{"text_format":"2","workbook":"xlsx","n_sheets":6,"sheets":["Instructions","Neurals","Data","Meetings","Race","Selections"],"not_rendered":{"charts":0,"images":0,"macros":1,"external_links":0,"defined_names":951,"comments":0,"pivot_tables":0},"unopened":[],"bounds":{"document_bytes":16777216,"sheet_cells":100000,"run_cost":"one","rows_first":2000,"rows_last":500,"rows_between":2000,"halvings":0,"cell_chars":16384,"cell_head_chars":4096},"cells_cut":0,"cells_raw":0,"read":"whole","date_system":"1900"}

{"sheet":"Instructions","index":0,"n_rows":10,"n_cols":11,"rows_kept":10,"cut":false,"hidden":false,"merged":[]}
[]
[]
[]
[]
[null,"Instructions"]
[]
[null,"You need to get the race code from",null,null,null,"http://www.racingandsports.com.au/form-guide/",{"$nulls":4},"click on each venue and get the last set of numbers from the address bar."]
[null,"On the \"Neurals\" sheet press \"Start\" press \"OK\" for todays date or put in a date, there is a drop down menue for the venue put in race code then 1st and last race numbers for that venue then press the \"Import\" button,"]
[null,"the race will be imported, if the top Neurals selection is also the unitab top rated it will copy to the \"Selections\" sheet."]
[null,"Each race will cycle through for that meeting, when done change the meeting and the race numbers and press import again."]
{"$rows_left_out":1}
{"sheet":"Neurals","index":1,"n_rows":59,"n_cols":29,"rows_kept":59,"cut":false,"hidden":false,"merged":[[2,5,2,7],[1,8,2,10]]}
[null,null,{"$f":"LARGE(F11:F100,1)","v":193},{"$f":"SMALL(H11:H100,1)","v":3.6},{"$nulls":13},{"$f":"IF(Race!D2=\"Paying\",\"Paying\",\"\")","v":""},null,{"$f":"B3","v":"TOWNSVILLE "},null,{"$f":"E3","v":9},null,{"$f":"SUM(V2:V100)","v":0},{"$f":"IF(ISNA(VLOOKUP(X1,$V$2:$W$100,2,FALSE)),\"\",(VLOOKUP(X1,$V$2:$W$100,2,FALSE)))","v":""},null,null,{"$f":"IF(R1<>\"\",IF(ISNA(VLOOKUP(Y1,Data!$C$3:$E$5,2,FALSE)),\"\",(VLOOKUP(Y1,Data!$C$3:$E$5,2,FALSE))),\"\")","v":""},{"$f":"IF(R1<>\"\",IF(ISNA(VLOOKUP(Y1,Data!$C$3:$E$5,1,FALSE)),\"\",(VLOOKUP(Y1,Data!$C$3:$E$5,3,FALSE))),\"\")","v":""}]
[null,"Race Venue",null,"Race Code","1st Race No","Last Race No"]
[null,"TOWNSVILLE ",null,19883,9,8]
[]
[]
[]
[]
[null,{"$f":"B3","v":"TOWNSVILLE "},null,"Race",{"$f":"E3","v":9}]
[]
["INC","TAB","HORSE","JOCKEY | TRAINER","WT","NR","HCP","PR","SCR","BP",{"$nulls":9},"NR","PR"]
{"$rows_left_out":50}
{"sheet":"Data","index":2,"n_rows":45,"n_cols":19,"rows_kept":45,"cut":false,"hidden":false,"merged":[]}
[{"$f":"Neurals!B3","v":"TOWNSVILLE "},{"$f":"Neurals!E3","v":9},{"$f":"Neurals!R1","v":""},null,"2011-10-25",null,{"$f":"IF(ISNA(VLOOKUP(A1,F2:Q40,B1+2,FALSE)),\"\",VLOOKUP(A1,F2:Q40,B1+2,FALSE))","v":"http://www.tabonline.com.au/2011/10/25/QG09.html"}]
[{"$nulls":5},{"$f":"IF(G2=\"\",\"\",IF(ISERROR(LEFT(G2,FIND(\"(\",G2,1)-1)),\"\",LEFT(G2,FIND(\"(\",G2,1)-1)))","v":"TAREE "},{"$f":"IF(Meetings!B4=\"\",\"\",Meetings!B4)","v":"TAREE (NR)"},{"$f":"IF(Meetings!D4=\"\",\"\",getAddress(Meetings!D4))","v":"http://www.tabonline.com.au/2011/10/25/NR01.html"},{"$f":"IF(Meetings!E4=\"\",\"\",getAddress(Meetings!E4))","v":"http://www.tabonline.com.au/2011/10/25/NR02.html"},{"$f":"IF(Meetings!F4=\"\",\"\",getAddress(Meetings!F4))","v":"http://www.tabonline.com.au/2011/10/25/NR03.html"},{"$f":"IF(Meetings!G4=\"\",\"\",getAddress(Meetings!G4))","v":"http://www.tabonline.com.au/2011/10/25/NR04.html"},{"$f":"IF(Meetings!H4=\"\",\"\",getAddress(Meetings!H4))","v":"http://www.tabonline.com.au/2011/10/25/NR05.html"},{"$f":"IF(Meetings!I4=\"\",\"\",getAddress(Meetings!I4))","v":"http://www.tabonline.com.au/2011/10/25/NR06.html"},{"$f":"IF(Meetings!J4=\"\",\"\",getAddress(Meetings!J4))","v":"http://www.tabonline.com.au/2011/10/25/NR07.html"},{"$f":"IF(Meetings!K4=\"\",\"\",getAddress(Meetings!K4))","v":"http://www.tabonline.com.au/2011/10/25/NR08.html"},{"$f":"IF(Meetings!L4=\"\",\"\",getAddress(Meetings!L4))","v":""},{"$f":"IF(Meetings!M4=\"\",\"\",getAddress(Meetings!M4))","v":""},null,{"$f":"IF(Meetings!AE4=\"\",\"\",Meetings!AE4)","v":""}]
[{"$f":"IF(Race!N1<>\"\",(CLEAN(TRIM(Race!C1))),\"\")","v":""},{"$f":"IF(A3<>\"\",Race!N1,\"\")","v":""},{"$f":"IF($C$1<>\"\",INDEX(Race!$A$1:$C20,MATCH(\"QN\",Race!$A1:$A$20,0)-4,3),\"\")","v":""},{"$f":"IF(ISNA(VLOOKUP(C3,Race!$C$2:$E$15,2,FALSE)),\"\",(VLOOKUP(C3,Race!$C$2:$E$15,2,FALSE)))","v":""},{"$f":"IF(ISNA(VLOOKUP(C3,Race!$C$2:$E$15,3,FALSE)),\"\",(VLOOKUP(C3,Race!$C$2:$E$15,3,FALSE)))","v":""},{"$f":"IF(H3=\"\",\"\",IF(ISERROR(LEFT(G3,FIND(\"(\",G3,1)-1)),\"\",LEFT(G3,FIND(\"(\",G3,1)-1)))","v":"SEYMOUR "},{"$f":"IF(Meetings!B5=\"\",\"\",Meetings!B5)","v":"SEYMOUR (VR)"},{"$f":"IF(Meetings!D5=\"\",\"\",getAddress(Meetings!D5))","v":"http://www.tabonline.com.au/2011/10/25/VR01.html"},{"$f":"IF(Meetings!E5=\"\",\"\",getAddress(Meetings!E5))","v":"http://www.tabonline.com.au/2011/10/25/VR02.html"},{"$f":"IF(Meetings!F5=\"\",\"\",getAddress(Meetings!F5))","v":"http://www.tabonline.com.au/2011/10/25/VR03.html"},{"$f":"IF(Meetings!G5=\"\",\"\",getAddress(Meetings!G5))","v":"http://www.tabonline.com.au/2011/10/25/VR04.html"},{"$f":"IF(Meetings!H5=\"\",\"\",getAddress(Meetings!H5))","v":"http://www.tabonline.com.au/2011/10/25/VR05.html"},{"$f":"IF(Meetings!I5=\"\",\"\",getAddress(Meetings!I5))","v":"http://www.tabonline.com.au/2011/10/25/VR06.html"},{"$f":"IF(Meetings!J5=\"\",\"\",getAddress(Meetings!J5))","v":"http://www.tabonline.com.au/2011/10/25/VR07.html"},{"$f":"IF(Meetings!K5=\"\",\"\",getAddress(Meetings!K5))","v":"http://www.tabonline.com.au/2011/10/25/VR08.html"},{"$f":"IF(Meetings!L5=\"\",\"\",getAddress(Meetings!L5))","v":""},{"$f":"IF(Meetings!M5=\"\",\"\",getAddress(Meetings!M5))","v":""},{"$f":"IF(Meetings!O5=\"\",\"\",Meetings!O5)","v":""},{"$f":"IF(Meetings!AE5=\"\",\"\",Meetings!AE5)","v":""}]
[{"$f":"IF(Race!N2<>\"\",(CLEAN(TRIM(Race!C2))),\"\")","v":""},{"$f":"IF(A4<>\"\",Race!N2,\"\")","v":""},{"$f":"IF($C$1<>\"\",INDEX(Race!$A$1:$C21,MATCH(\"QN\",Race!$A2:$A$20,0)-2,3),\"\")","v":""},{"$f":"IF(ISNA(VLOOKUP(C4,Race!$C$2:$E$15,2,FALSE)),\"\",(VLOOKUP(C4,Race!$C$2:$E$15,2,FALSE)))","v":""},{"$f":"IF(ISNA(VLOOKUP(C4,Race!$C$2:$E$15,3,FALSE)),\"\",(VLOOKUP(C4,Race!$C$2:$E$15,3,FALSE)))","v":""},{"$f":"IF(H4=\"\",\"\",IF(ISERROR(LEFT(G4,FIND(\"(\",G4,1)-1)),\"\",LEFT(G4,FIND(\"(\",G4,1)-1)))","v":"CHEPSTOW "},{"$f":"IF(Meetings!B6=\"\",\"\",Meetings!B6)","v":"CHEPSTOW (BS)"},{"$f":"IF(Meetings!D6=\"\",\"\",getAddress(Meetings!D6))","v":"http://www.tabonline.com.au/2011/10/25/BS01.html"},{"$f":"IF(Meetings!E6=\"\",\"\",getAddress(Meetings!E6))","v":"http://www.tabonline.com.au/2011/10/25/BS02.html"},{"$f":"IF(Meetings!F6=\"\",\"\",getAddress(Meetings!F6))","v":"http://www.tabonline.com.au/2011/10/25/BS03.html"},{"$f":"IF(Meetings!G6=\"\",\"\",getAddress(Meetings!G6))","v":"http://www.tabonline.com.au/2011/10/25/BS04.html"},{"$f":"IF(Meetings!H6=\"\",\"\",getAddress(Meetings!H6))","v":""},{"$f":"IF(Meetings!I6=\"\",\"\",getAddress(Meetings!I6))","v":""},{"$f":"IF(Meetings!J6=\"\",\"\",getAddress(Meetings!J6))","v":""},{"$f":"IF(Meetings!K6=\"\",\"\",getAddress(Meetings!K6))","v":""},{"$f":"IF(Meetings!L6=\"\",\"\",getAddress(Meetings!L6))","v":""},{"$f":"IF(Meetings!M6=\"\",\"\",getAddress(Meetings!M6))","v":""},{"$f":"IF(Meetings!O6=\"\",\"\",Meetings!O6)","v":""},{"$f":"IF(Meetings!AE6=\"\",\"\",Meetings!AE6)","v":""}]
[{"$f":"IF(Race!N3<>\"\",(CLEAN(TRIM(Race!C3))),\"\")","v":""},{"$f":"IF(A5<>\"\",Race!N3,\"\")","v":""},{"$f":"IF($C$1<>\"\",INDEX(Race!$A$1:$C22,MATCH(\"QN\",Race!$A3:$A$20,0)-0,3),\"\")","v":""},{"$f":"IF(ISNA(VLOOKUP(C5,Race!$C$2:$E$15,2,FALSE)),\"\",(VLOOKUP(C5,Race!$C$2:$E$15,2,FALSE)))","v":""},{"$f":"IF(ISNA(VLOOKUP(C5,Race!$C$2:$E$15,3,FALSE)),\"\",(VLOOKUP(C5,Race!$C$2:$E$15,3,FALSE)))","v":""},"CLAIRWOOD ",{"$f":"IF(Meetings!B7=\"\",\"\",Meetings!B7)","v":"CLAIRWOOD (AS)"},{"$f":"IF(Meetings!D7=\"\",\"\",getAddress(Meetings!D7))","v":"http://www.tabonline.com.au/2011/10/25/AS01.html"},{"$f":"IF(Meetings!E7=\"\",\"\",getAddress(Meetings!E7))","v":"http://www.tabonline.com.au/2011/10/25/AS02.html"},{"$f":"IF(Meetings!F7=\"\",\"\",getAddress(Meetings!F7))","v":"http://www.tabonline.com.au/2011/10/25/AS03.html"},{"$f":"IF(Meetings!G7=\"\",\"\",getAddress(Meetings!G7))","v":"http://www.tabonline.com.au/2011/10/25/AS04.html"},{"$f":"IF(Meetings!H7=\"\",\"\",getAddress(Meetings!H7))","v":"http://www.tabonline.com.au/2011/10/25/AS05.html"},{"$f":"IF(Meetings!I7=\"\",\"\",getAddress(Meetings!I7))","v":"http://www.tabonline.com.au/2011/10/25/AS06.html"},{"$f":"IF(Meetings!J7=\"\",\"\",getAddress(Meetings!J7))","v":"http://www.tabonline.com.au/2011/10/25/AS07.html"},{"$f":"IF(Meetings!K7=\"\",\"\",getAddress(Meetings!K7))","v":"http://www.tabonline.com.au/2011/10/25/AS08.html"},{"$f":"IF(Meetings!L7=\"\",\"\",getAddress(Meetings!L7))","v":""},{"$f":"IF(Meetings!M7=\"\",\"\",getAddress(Meetings!M7))","v":""},{"$f":"IF(Meetings!O7=\"\",\"\",Meetings!O7)","v":""},{"$f":"IF(Meetings!AE7=\"\",\"\",Meetings!AE7)","v":""}]
[{"$f":"IF(Race!N4<>\"\",(CLEAN(TRIM(Race!C4))),\"\")","v":""},{"$f":"IF(A6<>\"\",Race!N4,\"\")","v":""},null,null,null,"CATTERICK BRIDGE ",{"$f":"IF(Meetings!B8=\"\",\"\",Meetings!B8)","v":"CATTERICK BRIDGE (CS)"},{"$f":"IF(Meetings!D8=\"\",\"\",getAddress(Meetings!D8))","v":"http://www.tabonline.com.au/2011/10/25/CS01.html"},{"$f":"IF(Meetings!E8=\"\",\"\",getAddress(Meetings!E8))","v":"http://www.tabonline.com.au/2011/10/25/CS02.html"},{"$f":"IF(Meetings!F8=\"\",\"\",getAddress(Meetings!F8))","v":"http://www.tabonline.com.au/2011/10/25/CS03.html"},{"$f":"IF(Meetings!G8=\"\",\"\",getAddress(Meetings!G8))","v":"http://www.tabonline.com.au/2011/10/25/CS04.html"},{"$f":"IF(Meetings!H8=\"\",\"\",getAddress(Meetings!H8))","v":"http://www.tabonline.com.au/2011/10/25/CS05.html"},{"$f":"IF(Meetings!I8=\"\",\"\",getAddress(Meetings!I8))","v":""},{"$f":"IF(Meetings!J8=\"\",\"\",getAddress(Meetings!J8))","v":""},{"$f":"IF(Meetings!K8=\"\",\"\",getAddress(Meetings!K8))","v":""},{"$f":"IF(Meetings!L8=\"\",\"\",getAddress(Meetings!L8))","v":""},{"$f":"IF(Meetings!M8=\"\",\"\",getAddress(Meetings!M8))","v":""},{"$f":"IF(Meetings!O8=\"\",\"\",Meetings!O8)","v":""},{"$f":"IF(Meetings!AE8=\"\",\"\",Meetings!AE8)","v":""}]
[{"$f":"IF(Race!N5<>\"\",(CLEAN(TRIM(Race!C5))),\"\")","v":""},{"$f":"IF(A7<>\"\",Race!N5,\"\")","v":""},null,null,null,"GREAT YARMOUTH ",{"$f":"IF(Meetings!B9=\"\",\"\",Meetings!B9)","v":"GREAT YARMOUTH (ES)"},{"$f":"IF(Meetings!D9=\"\",\"\",getAddress(Meetings!D9))","v":"http://www.tabonline.com.au/2011/10/25/ES01.html"},{"$f":"IF(Meetings!E9=\"\",\"\",getAddress(Meetings!E9))","v":"http://www.tabonline.com.au/2011/10/25/ES02.html"},{"$f":"IF(Meetings!F9=\"\",\"\",getAddress(Meetings!F9))","v":"http://www.tabonline.com.au/2011/10/25/ES03.html"},{"$f":"IF(Meetings!G9=\"\",\"\",getAddress(Meetings!G9))","v":"http://www.tabonline.com.au/2011/10/25/ES04.html"},{"$f":"IF(Meetings!H9=\"\",\"\",getAddress(Meetings!H9))","v":"http://www.tabonline.com.au/2011/10/25/ES05.html"},{"$f":"IF(Meetings!I9=\"\",\"\",getAddress(Meetings!I9))","v":""},{"$f":"IF(Meetings!J9=\"\",\"\",getAddress(Meetings!J9))","v":""},{"$f":"IF(Meetings!K9=\"\",\"\",getAddress(Meetings!K9))","v":""},{"$f":"IF(Meetings!L9=\"\",\"\",getAddress(Meetings!L9))","v":""},{"$f":"IF(Meetings!M9=\"\",\"\",getAddress(Meetings!M9))","v":""},{"$f":"IF(Meetings!O9=\"\",\"\",Meetings!O9)","v":""},{"$f":"IF(Meetings!AE9=\"\",\"\",Meetings!AE9)","v":""}]
[{"$f":"IF(Race!N6<>\"\",(CLEAN(TRIM(Race!C6))),\"\")","v":""},{"$f":"IF(A8<>\"\",Race!N6,\"\")","v":""},null,null,null,{"$error":"#VALUE!"},{"$f":"IF(Meetings!B10=\"\",\"\",Meetings!B10)","v":""},{"$f":"IF(Meetings!D10=\"\",\"\",getAddress(Meetings!D10))","v":{"$error":"#VALUE!"}},{"$f":"IF(Meetings!E10=\"\",\"\",getAddress(Meetings!E10))","v":{"$error":"#VALUE!"}},{"$f":"IF(Meetings!F10=\"\",\"\",getAddress(Meetings!F10))","v":{"$error":"#VALUE!"}},{"$f":"IF(Meetings!G10=\"\",\"\",getAddress(Meetings!G10))","v":{"$error":"#VALUE!"}},{"$f":"IF(Meetings!H10=\"\",\"\",getAddress(Meetings!H10))","v":{"$error":"#VALUE!"}},{"$f":"IF(Meetings!I10=\"\",\"\",getAddress(Meetings!I10))","v":{"$error":"#VALUE!"}},{"$f":"IF(Meetings!J10=\"\",\"\",getAddress(Meetings!J10))","v":{"$error":"#VALUE!"}},{"$f":"IF(Meetings!K10=\"\",\"\",getAddress(Meetings!K10))","v":{"$error":"#VALUE!"}},{"$f":"IF(Meetings!L10=\"\",\"\",getAddress(Meetings!L10))","v":{"$error":"#VALUE!"}},{"$f":"IF(Meetings!M10=\"\",\"\",getAddress(Meetings!M10))","v":{"$error":"#VALUE!"}},{"$f":"IF(Meetings!O10=\"\",\"\",Meetings!O10)","v":12},{"$f":"IF(Meetings!AE10=\"\",\"\",Meetings!AE10)","v":""}]
[{"$f":"IF(Race!N7<>\"\",(CLEAN(TRIM(Race!C7))),\"\")","v":""},{"$f":"IF(A9<>\"\",Race!N7,\"\")","v":""},null,null,null,"ALBION PARK ",{"$f":"IF(Meetings!B11=\"\",\"\",Meetings!B11)","v":"ALBION PARK (BT)"},{"$f":"IF(Meetings!D11=\"\",\"\",getAddress(Meetings!D11))","v":"http://www.tabonline.com.au/2011/10/25/BT01.html"},{"$f":"IF(Meetings!E11=\"\",\"\",getAddress(Meetings!E11))","v":"http://www.tabonline.com.au/2011/10/25/BT02.html"},{"$f":"IF(Meetings!F11=\"\",\"\",getAddress(Meetings!F11))","v":"http://www.tabonline.com.au/2011/10/25/BT03.html"},{"$f":"IF(Meetings!G11=\"\",\"\",getAddress(Meetings!G11))","v":"http://www.tabonline.com.au/2011/10/25/BT04.html"},{"$f":"IF(Meetings!H11=\"\",\"\",getAddress(Meetings!H11))","v":"http://www.tabonline.com.au/2011/10/25/BT05.html"},{"$f":"IF(Meetings!I11=\"\",\"\",getAddress(Meetings!I11))","v":"http://www.tabonline.com.au/2011/10/25/BT06.html"},{"$f":"IF(Meetings!J11=\"\",\"\",getAddress(Meetings!J11))","v":"http://www.tabonline.com.au/2011/10/25/BT07.html"},{"$f":"IF(Meetings!K11=\"\",\"\",getAddress(Meetings!K11))","v":""},{"$f":"IF(Meetings!L11=\"\",\"\",getAddress(Meetings!L11))","v":""},{"$f":"IF(Meetings!M11=\"\",\"\",getAddress(Meetings!M11))","v":""},{"$f":"IF(Meetings!O11=\"\",\"\",Meetings!O11)","v":""},{"$f":"IF(Meetings!AE11=\"\",\"\",Meetings!AE11)","v":""}]
[{"$f":"IF(Race!N8<>\"\",(CLEAN(TRIM(Race!C8))),\"\")","v":""},{"$f":"IF(A10<>\"\",Race!N8,\"\")","v":""},null,null,null,"MENANGLE ",{"$f":"IF(Meetings!B12=\"\",\"\",Meetings!B12)","v":"MENANGLE (ST)"},{"$f":"IF(Meetings!D12=\"\",\"\",getAddress(Meetings!D12))","v":"http://www.tabonline.com.au/2011/10/25/ST01.html"},{"$f":"IF(Meetings!E12=\"\",\"\",getAddress(Meetings!E12))","v":"http://www.tabonline.com.au/2011/10/25/ST02.html"},{"$f":"IF(Meetings!F12=\"\",\"\",getAddress(Meetings!F12))","v":"http://www.tabonline.com.au/2011/10/25/ST03.html"},{"$f":"IF(Meetings!G12=\"\",\"\",getAddress(Meetings!G12))","v":"http://www.tabonline.com.au/2011/10/25/ST04.html"},{"$f":"IF(Meetings!H12=\"\",\"\",getAddress(Meetings!H12))","v":"http://www.tabonline.com.au/2011/10/25/ST05.html"},{"$f":"IF(Meetings!I12=\"\",\"\",getAddress(Meetings!I12))","v":"http://www.tabonline.com.au/2011/10/25/ST06.html"},{"$f":"IF(Meetings!J12=\"\",\"\",getAddress(Meetings!J12))","v":"http://www.tabonline.com.au/2011/10/25/ST07.html"},{"$f":"IF(Meetings!K12=\"\",\"\",getAddress(Meetings!K12))","v":"http://www.tabonline.com.au/2011/10/25/ST08.html"},{"$f":"IF(Meetings!L12=\"\",\"\",getAddress(Meetings!L12))","v":""},{"$f":"IF(Meetings!M12=\"\",\"\",getAddress(Meetings!M12))","v":""},{"$f":"IF(Meetings!O12=\"\",\"\",Meetings!O12)","v":""},{"$f":"IF(Meetings!AE12=\"\",\"\",Meetings!AE12)","v":""}]
{"$rows_left_out":36}
{"sheet":"Meetings","index":3,"n_rows":27,"n_cols":15,"rows_kept":27,"cut":false,"hidden":false,"merged":[[16,0,16,2],[1,0,1,2],[9,0,9,2]]}
[]
["Races",null,null,1,2,3,4,5,6,7,8,9,10,11,12]
[null,"TOWNSVILLE (QR)","Fields","5,8,2 F4","Interim F4","26m F4","2:35 F4","3:10 F4","3:45 F4","4:22 F4","4:57 F4"]
[null,"TAREE (NR)","Fields","8,7,6 ","2,11,6 ","11m ","46m ","2:50 F4","3:25 F4","4:05 F4","4:40 F4"]
[null,"SEYMOUR (VR)","Fields","11,9,1 ","6,8,3 ","1,7,6 ","1m ","31m F4","2:30 F4","3:00 F4","3:30 F4"]
[null,"CHEPSTOW (BS)","Fields","11:10:00","11:40:00","12:10am ","12:40am "]
[null,"CLAIRWOOD (AS)","Fields","08:30:00","09:05:00","09:40:00","10:15:00","10:50:00","11:25:00","12:05am ","12:40am "]
[null,"CATTERICK BRIDGE (CS)","Fields","10:50:00","11:20:00","11:50:00","12:20am ","12:50am "]
[null,"GREAT YARMOUTH (ES)","Fields","10:30:00","11:00:00","11:30:00","12:00am ","12:30am "]
["Trots",null,null,1,2,3,4,5,6,7,8,9,10,11,12]
{"$rows_left_out":18}
{"sheet":"Race","index":4,"n_rows":26,"n_cols":13,"rows_kept":26,"cut":false,"hidden":false,"merged":[]}
[]
["TOWNSVILLE",null,"QG 8","Jump","09:18:00"]
[null,null,null,"Odds","01:18:00"]
["2011-10-25","NORTH QUEENSLAND CUP HT3"]
["RADIO TAB","4-2-3-5",null,null,null,"498M","FINE","GOOD"]
["No.",null,"Name","11:39:00","Win","Plc",null,"Trainer  ","Box",null,null,"L3S","Rtng"]
[1,null,"SAMMY BOOKER",{"$nulls":4},"SCRATCHED"]
[2,null,"ANDY'S CHAOS",5.0999999999999996,11.9,3.4,null,"G OLSEN",null,null,null,113,86]
[3,null,"GALLIVANT GIRL",5.0999999999999996,11.9,3.4,null,"P RUDALL",null,null,null,723,97]
[4,null,"DON'T LISTEN",0,11.9,3.4,null,"B BELFORD",null,null,null,231,100]
{"$rows_left_out":17}
{"sheet":"Selections","index":5,"n_rows":100,"n_cols":15,"rows_kept":100,"cut":false,"hidden":false,"merged":[]}
["Venue",null,"Race",null,"No","Runner",null,null,"Win","Place",null,null,"Bets"]
["SEYMOUR ",null,1,null,4,"Hookedonafeeling",null,null,"","",null,null,{"$f":"IF(E2=\"\",\"\",E2&\". \"&F2)","v":"4. Hookedonafeeling"},{"$f":"IF(M2=\"\",\"\",A2)","v":"SEYMOUR "},{"$f":"IF(M2=\"\",\"\",C2)","v":1}]
["SEYMOUR ",null,2,null,3,"Flying Above",null,null,0,1.3,null,null,{"$f":"IF(E3=\"\",\"\",E3&\". \"&F3)","v":"3. Flying Above"},{"$f":"IF(M3=\"\",\"\",A3)","v":"SEYMOUR "},{"$f":"IF(M3=\"\",\"\",C3)","v":2}]
["SEYMOUR ",null,3,null,7,"Tizona",null,null,0,1.4,null,null,"7. Tizona","SEYMOUR ",3]
["SEYMOUR ",null,4,null,5,"Blasting",null,null,0,1,null,null,"5. Blasting","SEYMOUR ",4]
["SEYMOUR ",null,5,null,8,"Mossailey",null,null,"","",null,null,"8. Mossailey","SEYMOUR ",5]
["SEYMOUR ",null,6,null,9,"Victoria Street",null,null,"","",null,null,"9. Victoria Street","SEYMOUR ",6]
["SEYMOUR ",null,7,null,8,"Caradin",null,null,"","",null,null,"8. Caradin","SEYMOUR ",7]
["SEYMOUR ",null,8,null,7,"Exceed And Excite",null,null,"","",null,null,"7. Exceed And Excite","SEYMOUR ",8]
["TAREE ",null,1,null,8,"Slumdogmillionaire",null,null,5,1.5,null,null,"8. Slumdogmillionaire","TAREE ",1]
{"$rows_left_out":90}