{"text_format":"2","workbook":"xlsx","n_sheets":6,"sheets":["Instructions","Neurals","Data","Meetings","Race","Selections"],"not_rendered":{"charts":0,"images":0,"macros":1,"external_links":0,"defined_names":951,"comments":0,"pivot_tables":0},"unopened":[],"bounds":{"document_bytes":16777216,"sheet_cells":100000,"run_cost":"one","rows_first":2000,"rows_last":500,"rows_between":2000,"halvings":0,"cell_chars":16384,"cell_head_chars":4096},"cells_cut":0,"cells_raw":0,"read":"whole","date_system":"1900"}

{"sheet":"Instructions","index":0,"n_rows":10,"n_cols":11,"rows_kept":10,"cut":false,"hidden":false,"merged":[]}
[]
[]
[]
[]
[null,"Instructions"]
[]
[null,"You need to get the race code from",null,null,null,"http://www.racingandsports.com.au/form-guide/",{"$nulls":4},"click on each venue and get the last set of numbers from the address bar."]
[null,"On the \"Neurals\" sheet press \"Start\" press \"OK\" for todays date or put in a date, there is a drop down menue for the venue put in race code then 1st and last race numbers for that venue then press the \"Import\" button,"]
[null,"the race will be imported, if the top Neurals selection is also the unitab top rated it will copy to the \"Selections\" sheet."]
[null,"Each race will cycle through for that meeting, when done change the meeting and the race numbers and press import again."]

{"sheet":"Neurals","index":1,"n_rows":59,"n_cols":29,"rows_kept":59,"cut":false,"hidden":false,"merged":[[2,5,2,7],[1,8,2,10]]}
[null,null,{"$f":"LARGE(F11:F100,1)","v":193},{"$f":"SMALL(H11:H100,1)","v":3.6},{"$nulls":13},{"$f":"IF(Race!D2=\"Paying\",\"Paying\",\"\")","v":""},null,{"$f":"B3","v":"TOWNSVILLE "},null,{"$f":"E3","v":9},null,{"$f":"SUM(V2:V100)","v":0},{"$f":"IF(ISNA(VLOOKUP(X1,$V$2:$W$100,2,FALSE)),\"\",(VLOOKUP(X1,$V$2:$W$100,2,FALSE)))","v":""},null,null,{"$f":"IF(R1<>\"\",IF(ISNA(VLOOKUP(Y1,Data!$C$3:$E$5,2,FALSE)),\"\",(VLOOKUP(Y1,Data!$C$3:$E$5,2,FALSE))),\"\")","v":""},{"$f":"IF(R1<>\"\",IF(ISNA(VLOOKUP(Y1,Data!$C$3:$E$5,1,FALSE)),\"\",(VLOOKUP(Y1,Data!$C$3:$E$5,3,FALSE))),\"\")","v":""}]
[null,"Race Venue",null,"Race Code","1st Race No","Last Race No"]
[null,"TOWNSVILLE ",null,19883,9,8]
[]
[]
[]
[]
[null,{"$f":"B3","v":"TOWNSVILLE "},null,"Race",{"$f":"E3","v":9}]
[]
["INC","TAB","HORSE","JOCKEY | TRAINER","WT","NR","HCP","PR","SCR","BP",{"$nulls":9},"NR","PR"]
[null,null,null,"JOCKEY | TRAINER",{"$nulls":14},{"$f":"IF(G12=$C$1,G12,\"\")","v":""},{"$f":"IF(F11=$C$1,F11,\"\")","v":""},{"$f":"IF($D$1<3.3,IF(H11=$D$1,H11,\"\"),\"\")","v":""},{"$f":"IF(AND(T11<>\"\",U11<>\"\"),B11,\"\")","v":""},{"$f":"IF(V11=\"\",\"\",CLEAN(TRIM(C11)))","v":""}]
[null,1," Cash Attack "," Peter Cullen",58.5,94,null,20,0,14,{"$nulls":8},{"$f":"CLEAN(TRIM(B12))","v":"1"},{"$f":"IF(F12=$C$1,F12,\"\")","v":""},{"$f":"IF($D$1<3.3,IF(H12=$D$1,H12,\"\"),\"\")","v":""},{"$f":"IF(AND(T12<>\"\",U12<>\"\"),B12,\"\")","v":""},{"$f":"IF(V12=\"\",\"\",CLEAN(TRIM(C12)))","v":""}]
[null,null,null," John Erichsen",{"$nulls":14},"","","","",""]
[null,2," Super Shadow "," Chris Whiteley",57,193,null,3.6,0,12,{"$nulls":8},"2",193,"","",""]
[null,null,null," John Manzelmann",{"$nulls":14},"","","","",""]
[null,3," Lesner "," Graham Kliese",56.5,107,null,10,0,13,{"$nulls":8},"3","","","",""]
[null,null,null," Patrick Mcguire",{"$nulls":14},"","","","",""]
[null,4," Ulladulla "," Adrian Coome",56,118.5,null,8,0,9,{"$nulls":8},"4","","","",""]
[null,null,null," Janel Ryan",{"$nulls":14},"","","","",""]
[null,5," Reprobate "," Kerry Rockett",55.5,155.5,null,5,0,8,{"$nulls":8},"5","","","",""]
[null,null,null," Roy Chillemi",{"$nulls":14},"","","","",""]
[null,6," Diamond Pursuit "," Anthony Merrit",55,89.5,null,26,0,6,{"$nulls":8},"6","","","",""]
[null,null,null," John Robbins",{"$nulls":14},"","","","",""]
[null,7," On Bail "," Greg Cullen",55,104.5,null,12,0,7,{"$nulls":8},"7","","","",""]
[null,null,null," Olivia Cairns",{"$nulls":15},"","","",""]
[null,8," Wandering Star "," Frank Edwards",55,90,null,26,0,2,{"$nulls":9},"","","",""]
[null,null,null," Olivia Cairns",{"$nulls":15},"","","",""]
[null,9," Mighty Mite "," Trinity Bannon",54,68,null,61,0,10,{"$nulls":9},"","","",""]
[null,null,null," Olivia Cairns",{"$nulls":15},"","","",""]
[null,10," Rontgen "," Mark Elliott",54,101.5,null,14,0,4,{"$nulls":9},"","","",""]
[null,null,null," Ben Williams",{"$nulls":15},"","","",""]
[null,11," Jennings "," Luke Rolls",54,75.5,null,51,0,3,{"$nulls":9},"","","",""]
[null,null,null," Kerry Baumann",{"$nulls":15},"","","",""]
[null,12," People'S Choice "," Jeffrey Felix",54,90.5,null,26,0,11,{"$nulls":9},"","","",""]
[null,null,null," Ben Williams",{"$nulls":15},"","","",""]
[null,13," More Than Regal "," Ian Toward",54,96,null,17,0,5,{"$nulls":9},"","","",""]
[null,null,null," Maree A Young",{"$nulls":15},"","","",""]
[null,14," Miss Rye "," Dean Tanti",54,64.5,null,81,0,1,{"$nulls":9},"","","",""]
[null,null,null," Paula D'Addona",{"$nulls":15},"","","",""]
[{"$nulls":19},"","","",""]
[{"$nulls":19},"","","",""]
[{"$nulls":19},"","","",""]
[{"$nulls":19},"","","",""]
[{"$nulls":19},"","","",""]
[{"$nulls":19},"","","",""]
[{"$nulls":19},"","","",""]
[{"$nulls":19},"","","",""]
[{"$nulls":19},"","","",""]
[{"$nulls":19},"","","",""]
[{"$nulls":19},"","",""]
[{"$nulls":19},"","",""]
[{"$nulls":19},"","",""]
[{"$nulls":19},"","",""]
[{"$nulls":19},"","",""]
[{"$nulls":19},"","",""]
[{"$nulls":19},"","",""]
[{"$nulls":19},"","",""]
[{"$nulls":19},"","",""]
[{"$nulls":19},"","",""]

{"sheet":"Data","index":2,"n_rows":45,"n_cols":19,"rows_kept":45,"cut":false,"hidden":false,"merged":[]}
[{"$f":"Neurals!B3","v":"TOWNSVILLE "},{"$f":"Neurals!E3","v":9},{"$f":"Neurals!R1","v":""},null,"2011-10-25",null,{"$f":"IF(ISNA(VLOOKUP(A1,F2:Q40,B1+2,FALSE)),\"\",VLOOKUP(A1,F2:Q40,B1+2,FALSE))","v":"http://www.tabonline.com.au/2011/10/25/QG09.html"}]
[{"$nulls":5},{"$f":"IF(G2=\"\",\"\",IF(ISERROR(LEFT(G2,FIND(\"(\",G2,1)-1)),\"\",LEFT(G2,FIND(\"(\",G2,1)-1)))","v":"TAREE "},{"$f":"IF(Meetings!B4=\"\",\"\",Meetings!B4)","v":"TAREE (NR)"},{"$f":"IF(Meetings!D4=\"\",\"\",getAddress(Meetings!D4))","v":"http://www.tabonline.com.au/2011/10/25/NR01.html"},{"$f":"IF(Meetings!E4=\"\",\"\",getAddress(Meetings!E4))","v":"http://www.tabonline.com.au/2011/10/25/NR02.html"},{"$f":"IF(Meetings!F4=\"\",\"\",getAddress(Meetings!F4))","v":"http://www.tabonline.com.au/2011/10/25/NR03.html"},{"$f":"IF(Meetings!G4=\"\",\"\",getAddress(Meetings!G4))","v":"http://www.tabonline.com.au/2011/10/25/NR04.html"},{"$f":"IF(Meetings!H4=\"\",\"\",getAddress(Meetings!H4))","v":"http://www.tabonline.com.au/2011/10/25/NR05.html"},{"$f":"IF(Meetings!I4=\"\",\"\",getAddress(Meetings!I4))","v":"http://www.tabonline.com.au/2011/10/25/NR06.html"},{"$f":"IF(Meetings!J4=\"\",\"\",getAddress(Meetings!J4))","v":"http://www.tabonline.com.au/2011/10/25/NR07.html"},{"$f":"IF(Meetings!K4=\"\",\"\",getAddress(Meetings!K4))","v":"http://www.tabonline.com.au/2011/10/25/NR08.html"},{"$f":"IF(Meetings!L4=\"\",\"\",getAddress(Meetings!L4))","v":""},{"$f":"IF(Meetings!M4=\"\",\"\",getAddress(Meetings!M4))","v":""},null,{"$f":"IF(Meetings!AE4=\"\",\"\",Meetings!AE4)","v":""}]
[{"$f":"IF(Race!N1<>\"\",(CLEAN(TRIM(Race!C1))),\"\")","v":""},{"$f":"IF(A3<>\"\",Race!N1,\"\")","v":""},{"$f":"IF($C$1<>\"\",INDEX(Race!$A$1:$C20,MATCH(\"QN\",Race!$A1:$A$20,0)-4,3),\"\")","v":""},{"$f":"IF(ISNA(VLOOKUP(C3,Race!$C$2:$E$15,2,FALSE)),\"\",(VLOOKUP(C3,Race!$C$2:$E$15,2,FALSE)))","v":""},{"$f":"IF(ISNA(VLOOKUP(C3,Race!$C$2:$E$15,3,FALSE)),\"\",(VLOOKUP(C3,Race!$C$2:$E$15,3,FALSE)))","v":""},{"$f":"IF(H3=\"\",\"\",IF(ISERROR(LEFT(G3,FIND(\"(\",G3,1)-1)),\"\",LEFT(G3,FIND(\"(\",G3,1)-1)))","v":"SEYMOUR "},{"$f":"IF(Meetings!B5=\"\",\"\",Meetings!B5)","v":"SEYMOUR (VR)"},{"$f":"IF(Meetings!D5=\"\",\"\",getAddress(Meetings!D5))","v":"http://www.tabonline.com.au/2011/10/25/VR01.html"},{"$f":"IF(Meetings!E5=\"\",\"\",getAddress(Meetings!E5))","v":"http://www.tabonline.com.au/2011/10/25/VR02.html"},{"$f":"IF(Meetings!F5=\"\",\"\",getAddress(Meetings!F5))","v":"http://www.tabonline.com.au/2011/10/25/VR03.html"},{"$f":"IF(Meetings!G5=\"\",\"\",getAddress(Meetings!G5))","v":"http://www.tabonline.com.au/2011/10/25/VR04.html"},{"$f":"IF(Meetings!H5=\"\",\"\",getAddress(Meetings!H5))","v":"http://www.tabonline.com.au/2011/10/25/VR05.html"},{"$f":"IF(Meetings!I5=\"\",\"\",getAddress(Meetings!I5))","v":"http://www.tabonline.com.au/2011/10/25/VR06.html"},{"$f":"IF(Meetings!J5=\"\",\"\",getAddress(Meetings!J5))","v":"http://www.tabonline.com.au/2011/10/25/VR07.html"},{"$f":"IF(Meetings!K5=\"\",\"\",getAddress(Meetings!K5))","v":"http://www.tabonline.com.au/2011/10/25/VR08.html"},{"$f":"IF(Meetings!L5=\"\",\"\",getAddress(Meetings!L5))","v":""},{"$f":"IF(Meetings!M5=\"\",\"\",getAddress(Meetings!M5))","v":""},{"$f":"IF(Meetings!O5=\"\",\"\",Meetings!O5)","v":""},{"$f":"IF(Meetings!AE5=\"\",\"\",Meetings!AE5)","v":""}]
[{"$f":"IF(Race!N2<>\"\",(CLEAN(TRIM(Race!C2))),\"\")","v":""},{"$f":"IF(A4<>\"\",Race!N2,\"\")","v":""},{"$f":"IF($C$1<>\"\",INDEX(Race!$A$1:$C21,MATCH(\"QN\",Race!$A2:$A$20,0)-2,3),\"\")","v":""},{"$f":"IF(ISNA(VLOOKUP(C4,Race!$C$2:$E$15,2,FALSE)),\"\",(VLOOKUP(C4,Race!$C$2:$E$15,2,FALSE)))","v":""},{"$f":"IF(ISNA(VLOOKUP(C4,Race!$C$2:$E$15,3,FALSE)),\"\",(VLOOKUP(C4,Race!$C$2:$E$15,3,FALSE)))","v":""},{"$f":"IF(H4=\"\",\"\",IF(ISERROR(LEFT(G4,FIND(\"(\",G4,1)-1)),\"\",LEFT(G4,FIND(\"(\",G4,1)-1)))","v":"CHEPSTOW "},{"$f":"IF(Meetings!B6=\"\",\"\",Meetings!B6)","v":"CHEPSTOW (BS)"},{"$f":"IF(Meetings!D6=\"\",\"\",getAddress(Meetings!D6))","v":"http://www.tabonline.com.au/2011/10/25/BS01.html"},{"$f":"IF(Meetings!E6=\"\",\"\",getAddress(Meetings!E6))","v":"http://www.tabonline.com.au/2011/10/25/BS02.html"},{"$f":"IF(Meetings!F6=\"\",\"\",getAddress(Meetings!F6))","v":"http://www.tabonline.com.au/2011/10/25/BS03.html"},{"$f":"IF(Meetings!G6=\"\",\"\",getAddress(Meetings!G6))","v":"http://www.tabonline.com.au/2011/10/25/BS04.html"},{"$f":"IF(Meetings!H6=\"\",\"\",getAddress(Meetings!H6))","v":""},{"$f":"IF(Meetings!I6=\"\",\"\",getAddress(Meetings!I6))","v":""},{"$f":"IF(Meetings!J6=\"\",\"\",getAddress(Meetings!J6))","v":""},{"$f":"IF(Meetings!K6=\"\",\"\",getAddress(Meetings!K6))","v":""},{"$f":"IF(Meetings!L6=\"\",\"\",getAddress(Meetings!L6))","v":""},{"$f":"IF(Meetings!M6=\"\",\"\",getAddress(Meetings!M6))","v":""},{"$f":"IF(Meetings!O6=\"\",\"\",Meetings!O6)","v":""},{"$f":"IF(Meetings!AE6=\"\",\"\",Meetings!AE6)","v":""}]
[{"$f":"IF(Race!N3<>\"\",(CLEAN(TRIM(Race!C3))),\"\")","v":""},{"$f":"IF(A5<>\"\",Race!N3,\"\")","v":""},{"$f":"IF($C$1<>\"\",INDEX(Race!$A$1:$C22,MATCH(\"QN\",Race!$A3:$A$20,0)-0,3),\"\")","v":""},{"$f":"IF(ISNA(VLOOKUP(C5,Race!$C$2:$E$15,2,FALSE)),\"\",(VLOOKUP(C5,Race!$C$2:$E$15,2,FALSE)))","v":""},{"$f":"IF(ISNA(VLOOKUP(C5,Race!$C$2:$E$15,3,FALSE)),\"\",(VLOOKUP(C5,Race!$C$2:$E$15,3,FALSE)))","v":""},"CLAIRWOOD ",{"$f":"IF(Meetings!B7=\"\",\"\",Meetings!B7)","v":"CLAIRWOOD (AS)"},{"$f":"IF(Meetings!D7=\"\",\"\",getAddress(Meetings!D7))","v":"http://www.tabonline.com.au/2011/10/25/AS01.html"},{"$f":"IF(Meetings!E7=\"\",\"\",getAddress(Meetings!E7))","v":"http://www.tabonline.com.au/2011/10/25/AS02.html"},{"$f":"IF(Meetings!F7=\"\",\"\",getAddress(Meetings!F7))","v":"http://www.tabonline.com.au/2011/10/25/AS03.html"},{"$f":"IF(Meetings!G7=\"\",\"\",getAddress(Meetings!G7))","v":"http://www.tabonline.com.au/2011/10/25/AS04.html"},{"$f":"IF(Meetings!H7=\"\",\"\",getAddress(Meetings!H7))","v":"http://www.tabonline.com.au/2011/10/25/AS05.html"},{"$f":"IF(Meetings!I7=\"\",\"\",getAddress(Meetings!I7))","v":"http://www.tabonline.com.au/2011/10/25/AS06.html"},{"$f":"IF(Meetings!J7=\"\",\"\",getAddress(Meetings!J7))","v":"http://www.tabonline.com.au/2011/10/25/AS07.html"},{"$f":"IF(Meetings!K7=\"\",\"\",getAddress(Meetings!K7))","v":"http://www.tabonline.com.au/2011/10/25/AS08.html"},{"$f":"IF(Meetings!L7=\"\",\"\",getAddress(Meetings!L7))","v":""},{"$f":"IF(Meetings!M7=\"\",\"\",getAddress(Meetings!M7))","v":""},{"$f":"IF(Meetings!O7=\"\",\"\",Meetings!O7)","v":""},{"$f":"IF(Meetings!AE7=\"\",\"\",Meetings!AE7)","v":""}]
[{"$f":"IF(Race!N4<>\"\",(CLEAN(TRIM(Race!C4))),\"\")","v":""},{"$f":"IF(A6<>\"\",Race!N4,\"\")","v":""},null,null,null,"CATTERICK BRIDGE ",{"$f":"IF(Meetings!B8=\"\",\"\",Meetings!B8)","v":"CATTERICK BRIDGE (CS)"},{"$f":"IF(Meetings!D8=\"\",\"\",getAddress(Meetings!D8))","v":"http://www.tabonline.com.au/2011/10/25/CS01.html"},{"$f":"IF(Meetings!E8=\"\",\"\",getAddress(Meetings!E8))","v":"http://www.tabonline.com.au/2011/10/25/CS02.html"},{"$f":"IF(Meetings!F8=\"\",\"\",getAddress(Meetings!F8))","v":"http://www.tabonline.com.au/2011/10/25/CS03.html"},{"$f":"IF(Meetings!G8=\"\",\"\",getAddress(Meetings!G8))","v":"http://www.tabonline.com.au/2011/10/25/CS04.html"},{"$f":"IF(Meetings!H8=\"\",\"\",getAddress(Meetings!H8))","v":"http://www.tabonline.com.au/2011/10/25/CS05.html"},{"$f":"IF(Meetings!I8=\"\",\"\",getAddress(Meetings!I8))","v":""},{"$f":"IF(Meetings!J8=\"\",\"\",getAddress(Meetings!J8))","v":""},{"$f":"IF(Meetings!K8=\"\",\"\",getAddress(Meetings!K8))","v":""},{"$f":"IF(Meetings!L8=\"\",\"\",getAddress(Meetings!L8))","v":""},{"$f":"IF(Meetings!M8=\"\",\"\",getAddress(Meetings!M8))","v":""},{"$f":"IF(Meetings!O8=\"\",\"\",Meetings!O8)","v":""},{"$f":"IF(Meetings!AE8=\"\",\"\",Meetings!AE8)","v":""}]
[{"$f":"IF(Race!N5<>\"\",(CLEAN(TRIM(Race!C5))),\"\")","v":""},{"$f":"IF(A7<>\"\",Race!N5,\"\")","v":""},null,null,null,"GREAT YARMOUTH ",{"$f":"IF(Meetings!B9=\"\",\"\",Meetings!B9)","v":"GREAT YARMOUTH (ES)"},{"$f":"IF(Meetings!D9=\"\",\"\",getAddress(Meetings!D9))","v":"http://www.tabonline.com.au/2011/10/25/ES01.html"},{"$f":"IF(Meetings!E9=\"\",\"\",getAddress(Meetings!E9))","v":"http://www.tabonline.com.au/2011/10/25/ES02.html"},{"$f":"IF(Meetings!F9=\"\",\"\",getAddress(Meetings!F9))","v":"http://www.tabonline.com.au/2011/10/25/ES03.html"},{"$f":"IF(Meetings!G9=\"\",\"\",getAddress(Meetings!G9))","v":"http://www.tabonline.com.au/2011/10/25/ES04.html"},{"$f":"IF(Meetings!H9=\"\",\"\",getAddress(Meetings!H9))","v":"http://www.tabonline.com.au/2011/10/25/ES05.html"},{"$f":"IF(Meetings!I9=\"\",\"\",getAddress(Meetings!I9))","v":""},{"$f":"IF(Meetings!J9=\"\",\"\",getAddress(Meetings!J9))","v":""},{"$f":"IF(Meetings!K9=\"\",\"\",getAddress(Meetings!K9))","v":""},{"$f":"IF(Meetings!L9=\"\",\"\",getAddress(Meetings!L9))","v":""},{"$f":"IF(Meetings!M9=\"\",\"\",getAddress(Meetings!M9))","v":""},{"$f":"IF(Meetings!O9=\"\",\"\",Meetings!O9)","v":""},{"$f":"IF(Meetings!AE9=\"\",\"\",Meetings!AE9)","v":""}]
[{"$f":"IF(Race!N6<>\"\",(CLEAN(TRIM(Race!C6))),\"\")","v":""},{"$f":"IF(A8<>\"\",Race!N6,\"\")","v":""},null,null,null,{"$error":"#VALUE!"},{"$f":"IF(Meetings!B10=\"\",\"\",Meetings!B10)","v":""},{"$f":"IF(Meetings!D10=\"\",\"\",getAddress(Meetings!D10))","v":{"$error":"#VALUE!"}},{"$f":"IF(Meetings!E10=\"\",\"\",getAddress(Meetings!E10))","v":{"$error":"#VALUE!"}},{"$f":"IF(Meetings!F10=\"\",\"\",getAddress(Meetings!F10))","v":{"$error":"#VALUE!"}},{"$f":"IF(Meetings!G10=\"\",\"\",getAddress(Meetings!G10))","v":{"$error":"#VALUE!"}},{"$f":"IF(Meetings!H10=\"\",\"\",getAddress(Meetings!H10))","v":{"$error":"#VALUE!"}},{"$f":"IF(Meetings!I10=\"\",\"\",getAddress(Meetings!I10))","v":{"$error":"#VALUE!"}},{"$f":"IF(Meetings!J10=\"\",\"\",getAddress(Meetings!J10))","v":{"$error":"#VALUE!"}},{"$f":"IF(Meetings!K10=\"\",\"\",getAddress(Meetings!K10))","v":{"$error":"#VALUE!"}},{"$f":"IF(Meetings!L10=\"\",\"\",getAddress(Meetings!L10))","v":{"$error":"#VALUE!"}},{"$f":"IF(Meetings!M10=\"\",\"\",getAddress(Meetings!M10))","v":{"$error":"#VALUE!"}},{"$f":"IF(Meetings!O10=\"\",\"\",Meetings!O10)","v":12},{"$f":"IF(Meetings!AE10=\"\",\"\",Meetings!AE10)","v":""}]
[{"$f":"IF(Race!N7<>\"\",(CLEAN(TRIM(Race!C7))),\"\")","v":""},{"$f":"IF(A9<>\"\",Race!N7,\"\")","v":""},null,null,null,"ALBION PARK ",{"$f":"IF(Meetings!B11=\"\",\"\",Meetings!B11)","v":"ALBION PARK (BT)"},{"$f":"IF(Meetings!D11=\"\",\"\",getAddress(Meetings!D11))","v":"http://www.tabonline.com.au/2011/10/25/BT01.html"},{"$f":"IF(Meetings!E11=\"\",\"\",getAddress(Meetings!E11))","v":"http://www.tabonline.com.au/2011/10/25/BT02.html"},{"$f":"IF(Meetings!F11=\"\",\"\",getAddress(Meetings!F11))","v":"http://www.tabonline.com.au/2011/10/25/BT03.html"},{"$f":"IF(Meetings!G11=\"\",\"\",getAddress(Meetings!G11))","v":"http://www.tabonline.com.au/2011/10/25/BT04.html"},{"$f":"IF(Meetings!H11=\"\",\"\",getAddress(Meetings!H11))","v":"http://www.tabonline.com.au/2011/10/25/BT05.html"},{"$f":"IF(Meetings!I11=\"\",\"\",getAddress(Meetings!I11))","v":"http://www.tabonline.com.au/2011/10/25/BT06.html"},{"$f":"IF(Meetings!J11=\"\",\"\",getAddress(Meetings!J11))","v":"http://www.tabonline.com.au/2011/10/25/BT07.html"},{"$f":"IF(Meetings!K11=\"\",\"\",getAddress(Meetings!K11))","v":""},{"$f":"IF(Meetings!L11=\"\",\"\",getAddress(Meetings!L11))","v":""},{"$f":"IF(Meetings!M11=\"\",\"\",getAddress(Meetings!M11))","v":""},{"$f":"IF(Meetings!O11=\"\",\"\",Meetings!O11)","v":""},{"$f":"IF(Meetings!AE11=\"\",\"\",Meetings!AE11)","v":""}]
[{"$f":"IF(Race!N8<>\"\",(CLEAN(TRIM(Race!C8))),\"\")","v":""},{"$f":"IF(A10<>\"\",Race!N8,\"\")","v":""},null,null,null,"MENANGLE ",{"$f":"IF(Meetings!B12=\"\",\"\",Meetings!B12)","v":"MENANGLE (ST)"},{"$f":"IF(Meetings!D12=\"\",\"\",getAddress(Meetings!D12))","v":"http://www.tabonline.com.au/2011/10/25/ST01.html"},{"$f":"IF(Meetings!E12=\"\",\"\",getAddress(Meetings!E12))","v":"http://www.tabonline.com.au/2011/10/25/ST02.html"},{"$f":"IF(Meetings!F12=\"\",\"\",getAddress(Meetings!F12))","v":"http://www.tabonline.com.au/2011/10/25/ST03.html"},{"$f":"IF(Meetings!G12=\"\",\"\",getAddress(Meetings!G12))","v":"http://www.tabonline.com.au/2011/10/25/ST04.html"},{"$f":"IF(Meetings!H12=\"\",\"\",getAddress(Meetings!H12))","v":"http://www.tabonline.com.au/2011/10/25/ST05.html"},{"$f":"IF(Meetings!I12=\"\",\"\",getAddress(Meetings!I12))","v":"http://www.tabonline.com.au/2011/10/25/ST06.html"},{"$f":"IF(Meetings!J12=\"\",\"\",getAddress(Meetings!J12))","v":"http://www.tabonline.com.au/2011/10/25/ST07.html"},{"$f":"IF(Meetings!K12=\"\",\"\",getAddress(Meetings!K12))","v":"http://www.tabonline.com.au/2011/10/25/ST08.html"},{"$f":"IF(Meetings!L12=\"\",\"\",getAddress(Meetings!L12))","v":""},{"$f":"IF(Meetings!M12=\"\",\"\",getAddress(Meetings!M12))","v":""},{"$f":"IF(Meetings!O12=\"\",\"\",Meetings!O12)","v":""},{"$f":"IF(Meetings!AE12=\"\",\"\",Meetings!AE12)","v":""}]
[{"$f":"IF(Race!N9<>\"\",(CLEAN(TRIM(Race!C9))),\"\")","v":""},{"$f":"IF(A11<>\"\",Race!N9,\"\")","v":""},null,null,null,"BENDIGO ",{"$f":"IF(Meetings!B13=\"\",\"\",Meetings!B13)","v":"BENDIGO (MT)"},{"$f":"IF(Meetings!D13=\"\",\"\",getAddress(Meetings!D13))","v":"http://www.tabonline.com.au/2011/10/25/MT01.html"},{"$f":"IF(Meetings!E13=\"\",\"\",getAddress(Meetings!E13))","v":"http://www.tabonline.com.au/2011/10/25/MT02.html"},{"$f":"IF(Meetings!F13=\"\",\"\",getAddress(Meetings!F13))","v":"http://www.tabonline.com.au/2011/10/25/MT03.html"},{"$f":"IF(Meetings!G13=\"\",\"\",getAddress(Meetings!G13))","v":"http://www.tabonline.com.au/2011/10/25/MT04.html"},{"$f":"IF(Meetings!H13=\"\",\"\",getAddress(Meetings!H13))","v":"http://www.tabonline.com.au/2011/10/25/MT05.html"},{"$f":"IF(Meetings!I13=\"\",\"\",getAddress(Meetings!I13))","v":"http://www.tabonline.com.au/2011/10/25/MT06.html"},{"$f":"IF(Meetings!J13=\"\",\"\",getAddress(Meetings!J13))","v":"http://www.tabonline.com.au/2011/10/25/MT07.html"},{"$f":"IF(Meetings!K13=\"\",\"\",getAddress(Meetings!K13))","v":"http://www.tabonline.com.au/2011/10/25/MT08.html"},{"$f":"IF(Meetings!L13=\"\",\"\",getAddress(Meetings!L13))","v":""},{"$f":"IF(Meetings!M13=\"\",\"\",getAddress(Meetings!M13))","v":""},{"$f":"IF(Meetings!O13=\"\",\"\",Meetings!O13)","v":""},{"$f":"IF(Meetings!AE13=\"\",\"\",Meetings!AE13)","v":""}]
[{"$f":"IF(Race!N10<>\"\",(CLEAN(TRIM(Race!C10))),\"\")","v":""},{"$f":"IF(A12<>\"\",Race!N10,\"\")","v":""},null,null,null,"GLOBE DERBY ",{"$f":"IF(Meetings!B14=\"\",\"\",Meetings!B14)","v":"GLOBE DERBY (AT)"},{"$f":"IF(Meetings!D14=\"\",\"\",getAddress(Meetings!D14))","v":"http://www.tabonline.com.au/2011/10/25/AT01.html"},{"$f":"IF(Meetings!E14=\"\",\"\",getAddress(Meetings!E14))","v":"http://www.tabonline.com.au/2011/10/25/AT02.html"},{"$f":"IF(Meetings!F14=\"\",\"\",getAddress(Meetings!F14))","v":"http://www.tabonline.com.au/2011/10/25/AT03.html"},{"$f":"IF(Meetings!G14=\"\",\"\",getAddress(Meetings!G14))","v":"http://www.tabonline.com.au/2011/10/25/AT04.html"},{"$f":"IF(Meetings!H14=\"\",\"\",getAddress(Meetings!H14))","v":"http://www.tabonline.com.au/2011/10/25/AT05.html"},{"$f":"IF(Meetings!I14=\"\",\"\",getAddress(Meetings!I14))","v":"http://www.tabonline.com.au/2011/10/25/AT06.html"},{"$f":"IF(Meetings!J14=\"\",\"\",getAddress(Meetings!J14))","v":"http://www.tabonline.com.au/2011/10/25/AT07.html"},{"$f":"IF(Meetings!K14=\"\",\"\",getAddress(Meetings!K14))","v":""},{"$f":"IF(Meetings!L14=\"\",\"\",getAddress(Meetings!L14))","v":""},{"$f":"IF(Meetings!M14=\"\",\"\",getAddress(Meetings!M14))","v":""},{"$f":"IF(Meetings!O14=\"\",\"\",Meetings!O14)","v":""},{"$f":"IF(Meetings!AE14=\"\",\"\",Meetings!AE14)","v":""}]
[{"$f":"IF(Race!N11<>\"\",(CLEAN(TRIM(Race!C11))),\"\")","v":""},{"$f":"IF(A13<>\"\",Race!N11,\"\")","v":""},null,null,null,"NORTHAM ",{"$f":"IF(Meetings!B15=\"\",\"\",Meetings!B15)","v":"NORTHAM (PT)"},{"$f":"IF(Meetings!D15=\"\",\"\",getAddress(Meetings!D15))","v":"http://www.tabonline.com.au/2011/10/25/PT01.html"},{"$f":"IF(Meetings!E15=\"\",\"\",getAddress(Meetings!E15))","v":"http://www.tabonline.com.au/2011/10/25/PT02.html"},{"$f":"IF(Meetings!F15=\"\",\"\",getAddress(Meetings!F15))","v":"http://www.tabonline.com.au/2011/10/25/PT03.html"},{"$f":"IF(Meetings!G15=\"\",\"\",getAddress(Meetings!G15))","v":"http://www.tabonline.com.au/2011/10/25/PT04.html"},{"$f":"IF(Meetings!H15=\"\",\"\",getAddress(Meetings!H15))","v":"http://www.tabonline.com.au/2011/10/25/PT05.html"},{"$f":"IF(Meetings!I15=\"\",\"\",getAddress(Meetings!I15))","v":"http://www.tabonline.com.au/2011/10/25/PT06.html"},{"$f":"IF(Meetings!J15=\"\",\"\",getAddress(Meetings!J15))","v":"http://www.tabonline.com.au/2011/10/25/PT07.html"},{"$f":"IF(Meetings!K15=\"\",\"\",getAddress(Meetings!K15))","v":"http://www.tabonline.com.au/2011/10/25/PT08.html"},{"$f":"IF(Meetings!L15=\"\",\"\",getAddress(Meetings!L15))","v":""},{"$f":"IF(Meetings!M15=\"\",\"\",getAddress(Meetings!M15))","v":""},{"$f":"IF(Meetings!O15=\"\",\"\",Meetings!O15)","v":""},{"$f":"IF(Meetings!AE15=\"\",\"\",Meetings!AE15)","v":""}]
[{"$f":"IF(Race!N12<>\"\",(CLEAN(TRIM(Race!C12))),\"\")","v":""},{"$f":"IF(A14<>\"\",Race!N12,\"\")","v":""},null,null,null,"ASCOT PARK ",{"$f":"IF(Meetings!B16=\"\",\"\",Meetings!B16)","v":"ASCOT PARK (ZT)"},{"$f":"IF(Meetings!D16=\"\",\"\",getAddress(Meetings!D16))","v":"http://www.tabonline.com.au/2011/10/25/ZT01.html"},{"$f":"IF(Meetings!E16=\"\",\"\",getAddress(Meetings!E16))","v":"http://www.tabonline.com.au/2011/10/25/ZT02.html"},{"$f":"IF(Meetings!F16=\"\",\"\",getAddress(Meetings!F16))","v":"http://www.tabonline.com.au/2011/10/25/ZT03.html"},{"$f":"IF(Meetings!G16=\"\",\"\",getAddress(Meetings!G16))","v":"http://www.tabonline.com.au/2011/10/25/ZT04.html"},{"$f":"IF(Meetings!H16=\"\",\"\",getAddress(Meetings!H16))","v":"http://www.tabonline.com.au/2011/10/25/ZT05.html"},{"$f":"IF(Meetings!I16=\"\",\"\",getAddress(Meetings!I16))","v":"http://www.tabonline.com.au/2011/10/25/ZT06.html"},{"$f":"IF(Meetings!J16=\"\",\"\",getAddress(Meetings!J16))","v":"http://www.tabonline.com.au/2011/10/25/ZT07.html"},{"$f":"IF(Meetings!K16=\"\",\"\",getAddress(Meetings!K16))","v":"http://www.tabonline.com.au/2011/10/25/ZT08.html"},{"$f":"IF(Meetings!L16=\"\",\"\",getAddress(Meetings!L16))","v":"http://www.tabonline.com.au/2011/10/25/ZT09.html"},{"$f":"IF(Meetings!M16=\"\",\"\",getAddress(Meetings!M16))","v":"http://www.tabonline.com.au/2011/10/25/ZT10.html"},{"$f":"IF(Meetings!O16=\"\",\"\",Meetings!O16)","v":""},{"$f":"IF(Meetings!AE16=\"\",\"\",Meetings!AE16)","v":""}]
[{"$f":"IF(Race!N13<>\"\",(CLEAN(TRIM(Race!C13))),\"\")","v":""},{"$f":"IF(A15<>\"\",Race!N13,\"\")","v":""},null,null,null,{"$error":"#VALUE!"},{"$f":"IF(Meetings!B17=\"\",\"\",Meetings!B17)","v":""},{"$f":"IF(Meetings!D17=\"\",\"\",getAddress(Meetings!D17))","v":{"$error":"#VALUE!"}},{"$f":"IF(Meetings!E17=\"\",\"\",getAddress(Meetings!E17))","v":{"$error":"#VALUE!"}},{"$f":"IF(Meetings!F17=\"\",\"\",getAddress(Meetings!F17))","v":{"$error":"#VALUE!"}},{"$f":"IF(Meetings!G17=\"\",\"\",getAddress(Meetings!G17))","v":{"$error":"#VALUE!"}},{"$f":"IF(Meetings!H17=\"\",\"\",getAddress(Meetings!H17))","v":{"$error":"#VALUE!"}},{"$f":"IF(Meetings!I17=\"\",\"\",getAddress(Meetings!I17))","v":{"$error":"#VALUE!"}},{"$f":"IF(Meetings!J17=\"\",\"\",getAddress(Meetings!J17))","v":{"$error":"#VALUE!"}},{"$f":"IF(Meetings!K17=\"\",\"\",getAddress(Meetings!K17))","v":{"$error":"#VALUE!"}},{"$f":"IF(Meetings!L17=\"\",\"\",getAddress(Meetings!L17))","v":{"$error":"#VALUE!"}},{"$f":"IF(Meetings!M17=\"\",\"\",getAddress(Meetings!M17))","v":{"$error":"#VALUE!"}},{"$f":"IF(Meetings!O17=\"\",\"\",Meetings!O17)","v":12},{"$f":"IF(Meetings!AE17=\"\",\"\",Meetings!AE17)","v":""}]
[{"$f":"IF(Race!N14<>\"\",(CLEAN(TRIM(Race!C14))),\"\")","v":""},{"$f":"IF(A16<>\"\",Race!N14,\"\")","v":""},null,null,null,"IPSWICH ",{"$f":"IF(Meetings!B18=\"\",\"\",Meetings!B18)","v":"IPSWICH (BG)"},{"$f":"IF(Meetings!D18=\"\",\"\",getAddress(Meetings!D18))","v":"http://www.tabonline.com.au/2011/10/25/BG01.html"},{"$f":"IF(Meetings!E18=\"\",\"\",getAddress(Meetings!E18))","v":"http://www.tabonline.com.au/2011/10/25/BG02.html"},{"$f":"IF(Meetings!F18=\"\",\"\",getAddress(Meetings!F18))","v":"http://www.tabonline.com.au/2011/10/25/BG03.html"},{"$f":"IF(Meetings!G18=\"\",\"\",getAddress(Meetings!G18))","v":"http://www.tabonline.com.au/2011/10/25/BG04.html"},{"$f":"IF(Meetings!H18=\"\",\"\",getAddress(Meetings!H18))","v":"http://www.tabonline.com.au/2011/10/25/BG05.html"},{"$f":"IF(Meetings!I18=\"\",\"\",getAddress(Meetings!I18))","v":"http://www.tabonline.com.au/2011/10/25/BG06.html"},{"$f":"IF(Meetings!J18=\"\",\"\",getAddress(Meetings!J18))","v":"http://www.tabonline.com.au/2011/10/25/BG07.html"},{"$f":"IF(Meetings!K18=\"\",\"\",getAddress(Meetings!K18))","v":"http://www.tabonline.com.au/2011/10/25/BG08.html"},{"$f":"IF(Meetings!L18=\"\",\"\",getAddress(Meetings!L18))","v":"http://www.tabonline.com.au/2011/10/25/BG09.html"},{"$f":"IF(Meetings!M18=\"\",\"\",getAddress(Meetings!M18))","v":"http://www.tabonline.com.au/2011/10/25/BG10.html"},{"$f":"IF(Meetings!O18=\"\",\"\",Meetings!O18)","v":""},{"$f":"IF(Meetings!AE18=\"\",\"\",Meetings!AE18)","v":""}]
[{"$f":"IF(Race!N15<>\"\",(CLEAN(TRIM(Race!C15))),\"\")","v":""},{"$f":"IF(A17<>\"\",Race!N15,\"\")","v":""},null,null,null,"GOSFORD ",{"$f":"IF(Meetings!B19=\"\",\"\",Meetings!B19)","v":"GOSFORD (SG)"},{"$f":"IF(Meetings!D19=\"\",\"\",getAddress(Meetings!D19))","v":"http://www.tabonline.com.au/2011/10/25/SG01.html"},{"$f":"IF(Meetings!E19=\"\",\"\",getAddress(Meetings!E19))","v":"http://www.tabonline.com.au/2011/10/25/SG02.html"},{"$f":"IF(Meetings!F19=\"\",\"\",getAddress(Meetings!F19))","v":"http://www.tabonline.com.au/2011/10/25/SG03.html"},{"$f":"IF(Meetings!G19=\"\",\"\",getAddress(Meetings!G19))","v":"http://www.tabonline.com.au/2011/10/25/SG04.html"},{"$f":"IF(Meetings!H19=\"\",\"\",getAddress(Meetings!H19))","v":"http://www.tabonline.com.au/2011/10/25/SG05.html"},{"$f":"IF(Meetings!I19=\"\",\"\",getAddress(Meetings!I19))","v":"http://www.tabonline.com.au/2011/10/25/SG06.html"},{"$f":"IF(Meetings!J19=\"\",\"\",getAddress(Meetings!J19))","v":"http://www.tabonline.com.au/2011/10/25/SG07.html"},{"$f":"IF(Meetings!K19=\"\",\"\",getAddress(Meetings!K19))","v":"http://www.tabonline.com.au/2011/10/25/SG08.html"},{"$f":"IF(Meetings!L19=\"\",\"\",getAddress(Meetings!L19))","v":"http://www.tabonline.com.au/2011/10/25/SG09.html"},{"$f":"IF(Meetings!M19=\"\",\"\",getAddress(Meetings!M19))","v":"http://www.tabonline.com.au/2011/10/25/SG10.html"},{"$f":"IF(Meetings!O19=\"\",\"\",Meetings!O19)","v":""},{"$f":"IF(Meetings!AE19=\"\",\"\",Meetings!AE19)","v":""}]
[{"$f":"IF(Race!N16<>\"\",(CLEAN(TRIM(Race!C16))),\"\")","v":""},{"$f":"IF(A18<>\"\",Race!N16,\"\")","v":""},null,null,null,"WARRAGUL ",{"$f":"IF(Meetings!B20=\"\",\"\",Meetings!B20)","v":"WARRAGUL (MG)"},{"$f":"IF(Meetings!D20=\"\",\"\",getAddress(Meetings!D20))","v":"http://www.tabonline.com.au/2011/10/25/MG01.html"},{"$f":"IF(Meetings!E20=\"\",\"\",getAddress(Meetings!E20))","v":"http://www.tabonline.com.au/2011/10/25/MG02.html"},{"$f":"IF(Meetings!F20=\"\",\"\",getAddress(Meetings!F20))","v":"http://www.tabonline.com.au/2011/10/25/MG03.html"},{"$f":"IF(Meetings!G20=\"\",\"\",getAddress(Meetings!G20))","v":"http://www.tabonline.com.au/2011/10/25/MG04.html"},{"$f":"IF(Meetings!H20=\"\",\"\",getAddress(Meetings!H20))","v":"http://www.tabonline.com.au/2011/10/25/MG05.html"},{"$f":"IF(Meetings!I20=\"\",\"\",getAddress(Meetings!I20))","v":"http://www.tabonline.com.au/2011/10/25/MG06.html"},{"$f":"IF(Meetings!J20=\"\",\"\",getAddress(Meetings!J20))","v":"http://www.tabonline.com.au/2011/10/25/MG07.html"},{"$f":"IF(Meetings!K20=\"\",\"\",getAddress(Meetings!K20))","v":"http://www.tabonline.com.au/2011/10/25/MG08.html"},{"$f":"IF(Meetings!L20=\"\",\"\",getAddress(Meetings!L20))","v":"http://www.tabonline.com.au/2011/10/25/MG09.html"},{"$f":"IF(Meetings!M20=\"\",\"\",getAddress(Meetings!M20))","v":"http://www.tabonline.com.au/2011/10/25/MG10.html"},{"$f":"IF(Meetings!O20=\"\",\"\",Meetings!O20)","v":0.3923611111111111},{"$f":"IF(Meetings!AE20=\"\",\"\",Meetings!AE20)","v":""}]
[{"$f":"IF(Race!N17<>\"\",(CLEAN(TRIM(Race!C17))),\"\")","v":""},{"$f":"IF(A19<>\"\",Race!N17,\"\")","v":""},null,null,null,"TOWNSVILLE ",{"$f":"IF(Meetings!B21=\"\",\"\",Meetings!B21)","v":"TOWNSVILLE (QG)"},{"$f":"IF(Meetings!D21=\"\",\"\",getAddress(Meetings!D21))","v":"http://www.tabonline.com.au/2011/10/25/QG01.html"},{"$f":"IF(Meetings!E21=\"\",\"\",getAddress(Meetings!E21))","v":"http://www.tabonline.com.au/2011/10/25/QG02.html"},{"$f":"IF(Meetings!F21=\"\",\"\",getAddress(Meetings!F21))","v":"http://www.tabonline.com.au/2011/10/25/QG03.html"},{"$f":"IF(Meetings!G21=\"\",\"\",getAddress(Meetings!G21))","v":"http://www.tabonline.com.au/2011/10/25/QG04.html"},{"$f":"IF(Meetings!H21=\"\",\"\",getAddress(Meetings!H21))","v":"http://www.tabonline.com.au/2011/10/25/QG05.html"},{"$f":"IF(Meetings!I21=\"\",\"\",getAddress(Meetings!I21))","v":"http://www.tabonline.com.au/2011/10/25/QG06.html"},{"$f":"IF(Meetings!J21=\"\",\"\",getAddress(Meetings!J21))","v":"http://www.tabonline.com.au/2011/10/25/QG07.html"},{"$f":"IF(Meetings!K21=\"\",\"\",getAddress(Meetings!K21))","v":"http://www.tabonline.com.au/2011/10/25/QG08.html"},{"$f":"IF(Meetings!L21=\"\",\"\",getAddress(Meetings!L21))","v":"http://www.tabonline.com.au/2011/10/25/QG09.html"},{"$f":"IF(Meetings!M21=\"\",\"\",getAddress(Meetings!M21))","v":"http://www.tabonline.com.au/2011/10/25/QG10.html"},{"$f":"IF(Meetings!O21=\"\",\"\",Meetings!O21)","v":""},{"$f":"IF(Meetings!AE21=\"\",\"\",Meetings!AE21)","v":""}]
[{"$f":"IF(Race!N18<>\"\",(CLEAN(TRIM(Race!C18))),\"\")","v":""},{"$f":"IF(A20<>\"\",Race!N18,\"\")","v":""},null,null,null,"LISMORE ",{"$f":"IF(Meetings!B22=\"\",\"\",Meetings!B22)","v":"LISMORE (NG)"},{"$f":"IF(Meetings!D22=\"\",\"\",getAddress(Meetings!D22))","v":"http://www.tabonline.com.au/2011/10/25/NG01.html"},{"$f":"IF(Meetings!E22=\"\",\"\",getAddress(Meetings!E22))","v":"http://www.tabonline.com.au/2011/10/25/NG02.html"},{"$f":"IF(Meetings!F22=\"\",\"\",getAddress(Meetings!F22))","v":"http://www.tabonline.com.au/2011/10/25/NG03.html"},{"$f":"IF(Meetings!G22=\"\",\"\",getAddress(Meetings!G22))","v":"http://www.tabonline.com.au/2011/10/25/NG04.html"},{"$f":"IF(Meetings!H22=\"\",\"\",getAddress(Meetings!H22))","v":"http://www.tabonline.com.au/2011/10/25/NG05.html"},{"$f":"IF(Meetings!I22=\"\",\"\",getAddress(Meetings!I22))","v":"http://www.tabonline.com.au/2011/10/25/NG06.html"},{"$f":"IF(Meetings!J22=\"\",\"\",getAddress(Meetings!J22))","v":"http://www.tabonline.com.au/2011/10/25/NG07.html"},{"$f":"IF(Meetings!K22=\"\",\"\",getAddress(Meetings!K22))","v":"http://www.tabonline.com.au/2011/10/25/NG08.html"},{"$f":"IF(Meetings!L22=\"\",\"\",getAddress(Meetings!L22))","v":"http://www.tabonline.com.au/2011/10/25/NG09.html"},{"$f":"IF(Meetings!M22=\"\",\"\",getAddress(Meetings!M22))","v":"http://www.tabonline.com.au/2011/10/25/NG10.html"},{"$f":"IF(Meetings!O22=\"\",\"\",Meetings!O22)","v":""},{"$f":"IF(Meetings!AE22=\"\",\"\",Meetings!AE22)","v":""}]
[{"$f":"IF(Race!N19<>\"\",(CLEAN(TRIM(Race!C19))),\"\")","v":""},{"$f":"IF(A21<>\"\",Race!N19,\"\")","v":""},null,null,null,"HORSHAM ",{"$f":"IF(Meetings!B23=\"\",\"\",Meetings!B23)","v":"HORSHAM (VG)"},{"$f":"IF(Meetings!D23=\"\",\"\",getAddress(Meetings!D23))","v":"http://www.tabonline.com.au/2011/10/25/VG01.html"},{"$f":"IF(Meetings!E23=\"\",\"\",getAddress(Meetings!E23))","v":"http://www.tabonline.com.au/2011/10/25/VG02.html"},{"$f":"IF(Meetings!F23=\"\",\"\",getAddress(Meetings!F23))","v":"http://www.tabonline.com.au/2011/10/25/VG03.html"},{"$f":"IF(Meetings!G23=\"\",\"\",getAddress(Meetings!G23))","v":"http://www.tabonline.com.au/2011/10/25/VG04.html"},{"$f":"IF(Meetings!H23=\"\",\"\",getAddress(Meetings!H23))","v":"http://www.tabonline.com.au/2011/10/25/VG05.html"},{"$f":"IF(Meetings!I23=\"\",\"\",getAddress(Meetings!I23))","v":"http://www.tabonline.com.au/2011/10/25/VG06.html"},{"$f":"IF(Meetings!J23=\"\",\"\",getAddress(Meetings!J23))","v":"http://www.tabonline.com.au/2011/10/25/VG07.html"},{"$f":"IF(Meetings!K23=\"\",\"\",getAddress(Meetings!K23))","v":"http://www.tabonline.com.au/2011/10/25/VG08.html"},{"$f":"IF(Meetings!L23=\"\",\"\",getAddress(Meetings!L23))","v":"http://www.tabonline.com.au/2011/10/25/VG09.html"},{"$f":"IF(Meetings!M23=\"\",\"\",getAddress(Meetings!M23))","v":"http://www.tabonline.com.au/2011/10/25/VG10.html"},{"$f":"IF(Meetings!O23=\"\",\"\",Meetings!O23)","v":0.26041666666666669},{"$f":"IF(Meetings!AE23=\"\",\"\",Meetings!AE23)","v":""}]
[{"$f":"IF(Race!N20<>\"\",(CLEAN(TRIM(Race!C20))),\"\")","v":""},{"$f":"IF(A22<>\"\",Race!N20,\"\")","v":""},null,null,null,"GAWLER ",{"$f":"IF(Meetings!B24=\"\",\"\",Meetings!B24)","v":"GAWLER (AG)"},{"$f":"IF(Meetings!D24=\"\",\"\",getAddress(Meetings!D24))","v":"http://www.tabonline.com.au/2011/10/25/AG01.html"},{"$f":"IF(Meetings!E24=\"\",\"\",getAddress(Meetings!E24))","v":"http://www.tabonline.com.au/2011/10/25/AG02.html"},{"$f":"IF(Meetings!F24=\"\",\"\",getAddress(Meetings!F24))","v":"http://www.tabonline.com.au/2011/10/25/AG03.html"},{"$f":"IF(Meetings!G24=\"\",\"\",getAddress(Meetings!G24))","v":"http://www.tabonline.com.au/2011/10/25/AG04.html"},{"$f":"IF(Meetings!H24=\"\",\"\",getAddress(Meetings!H24))","v":"http://www.tabonline.com.au/2011/10/25/AG05.html"},{"$f":"IF(Meetings!I24=\"\",\"\",getAddress(Meetings!I24))","v":"http://www.tabonline.com.au/2011/10/25/AG06.html"},{"$f":"IF(Meetings!J24=\"\",\"\",getAddress(Meetings!J24))","v":"http://www.tabonline.com.au/2011/10/25/AG07.html"},{"$f":"IF(Meetings!K24=\"\",\"\",getAddress(Meetings!K24))","v":"http://www.tabonline.com.au/2011/10/25/AG08.html"},{"$f":"IF(Meetings!L24=\"\",\"\",getAddress(Meetings!L24))","v":"http://www.tabonline.com.au/2011/10/25/AG09.html"},{"$f":"IF(Meetings!M24=\"\",\"\",getAddress(Meetings!M24))","v":"http://www.tabonline.com.au/2011/10/25/AG10.html"},{"$f":"IF(Meetings!O24=\"\",\"\",Meetings!O24)","v":""},{"$f":"IF(Meetings!AE24=\"\",\"\",Meetings!AE24)","v":""}]
[{"$f":"IF(Race!N21<>\"\",(CLEAN(TRIM(Race!C21))),\"\")","v":""},{"$f":"IF(A23<>\"\",Race!N21,\"\")","v":""},null,null,null,"MANDURAH ",{"$f":"IF(Meetings!B25=\"\",\"\",Meetings!B25)","v":"MANDURAH (PG)"},{"$f":"IF(Meetings!D25=\"\",\"\",getAddress(Meetings!D25))","v":"http://www.tabonline.com.au/2011/10/25/PG01.html"},{"$f":"IF(Meetings!E25=\"\",\"\",getAddress(Meetings!E25))","v":"http://www.tabonline.com.au/2011/10/25/PG02.html"},{"$f":"IF(Meetings!F25=\"\",\"\",getAddress(Meetings!F25))","v":"http://www.tabonline.com.au/2011/10/25/PG03.html"},{"$f":"IF(Meetings!G25=\"\",\"\",getAddress(Meetings!G25))","v":"http://www.tabonline.com.au/2011/10/25/PG04.html"},{"$f":"IF(Meetings!H25=\"\",\"\",getAddress(Meetings!H25))","v":"http://www.tabonline.com.au/2011/10/25/PG05.html"},{"$f":"IF(Meetings!I25=\"\",\"\",getAddress(Meetings!I25))","v":"http://www.tabonline.com.au/2011/10/25/PG06.html"},{"$f":"IF(Meetings!J25=\"\",\"\",getAddress(Meetings!J25))","v":"http://www.tabonline.com.au/2011/10/25/PG07.html"},{"$f":"IF(Meetings!K25=\"\",\"\",getAddress(Meetings!K25))","v":"http://www.tabonline.com.au/2011/10/25/PG08.html"},{"$f":"IF(Meetings!L25=\"\",\"\",getAddress(Meetings!L25))","v":"http://www.tabonline.com.au/2011/10/25/PG09.html"},{"$f":"IF(Meetings!M25=\"\",\"\",getAddress(Meetings!M25))","v":"http://www.tabonline.com.au/2011/10/25/PG10.html"},{"$f":"IF(Meetings!O25=\"\",\"\",Meetings!O25)","v":0.47013888888888888},{"$f":"IF(Meetings!AE25=\"\",\"\",Meetings!AE25)","v":""}]
[{"$f":"IF(Race!N22<>\"\",(CLEAN(TRIM(Race!C22))),\"\")","v":""},{"$f":"IF(A24<>\"\",Race!N22,\"\")","v":""},null,null,null,"ADDINGTON ",{"$f":"IF(Meetings!B26=\"\",\"\",Meetings!B26)","v":"ADDINGTON (ZG)"},{"$f":"IF(Meetings!D26=\"\",\"\",getAddress(Meetings!D26))","v":"http://www.tabonline.com.au/2011/10/25/ZG01.html"},{"$f":"IF(Meetings!E26=\"\",\"\",getAddress(Meetings!E26))","v":"http://www.tabonline.com.au/2011/10/25/ZG02.html"},{"$f":"IF(Meetings!F26=\"\",\"\",getAddress(Meetings!F26))","v":"http://www.tabonline.com.au/2011/10/25/ZG03.html"},{"$f":"IF(Meetings!G26=\"\",\"\",getAddress(Meetings!G26))","v":"http://www.tabonline.com.au/2011/10/25/ZG04.html"},{"$f":"IF(Meetings!H26=\"\",\"\",getAddress(Meetings!H26))","v":"http://www.tabonline.com.au/2011/10/25/ZG05.html"},{"$f":"IF(Meetings!I26=\"\",\"\",getAddress(Meetings!I26))","v":"http://www.tabonline.com.au/2011/10/25/ZG06.html"},{"$f":"IF(Meetings!J26=\"\",\"\",getAddress(Meetings!J26))","v":"http://www.tabonline.com.au/2011/10/25/ZG07.html"},{"$f":"IF(Meetings!K26=\"\",\"\",getAddress(Meetings!K26))","v":"http://www.tabonline.com.au/2011/10/25/ZG08.html"},{"$f":"IF(Meetings!L26=\"\",\"\",getAddress(Meetings!L26))","v":"http://www.tabonline.com.au/2011/10/25/ZG09.html"},{"$f":"IF(Meetings!M26=\"\",\"\",getAddress(Meetings!M26))","v":"http://www.tabonline.com.au/2011/10/25/ZG10.html"},{"$f":"IF(Meetings!O26=\"\",\"\",Meetings!O26)","v":"1,2,3 "},{"$f":"IF(Meetings!AE26=\"\",\"\",Meetings!AE26)","v":""}]
[{"$f":"IF(Race!N23<>\"\",(CLEAN(TRIM(Race!C23))),\"\")","v":""},{"$f":"IF(A25<>\"\",Race!N23,\"\")","v":""},null,null,null,"DEVONPORT ",{"$f":"IF(Meetings!B27=\"\",\"\",Meetings!B27)","v":"DEVONPORT (TG)"},{"$f":"IF(Meetings!D27=\"\",\"\",getAddress(Meetings!D27))","v":"http://www.tabonline.com.au/2011/10/25/TG01.html"},{"$f":"IF(Meetings!E27=\"\",\"\",getAddress(Meetings!E27))","v":"http://www.tabonline.com.au/2011/10/25/TG02.html"},{"$f":"IF(Meetings!F27=\"\",\"\",getAddress(Meetings!F27))","v":"http://www.tabonline.com.au/2011/10/25/TG03.html"},{"$f":"IF(Meetings!G27=\"\",\"\",getAddress(Meetings!G27))","v":"http://www.tabonline.com.au/2011/10/25/TG04.html"},{"$f":"IF(Meetings!H27=\"\",\"\",getAddress(Meetings!H27))","v":"http://www.tabonline.com.au/2011/10/25/TG05.html"},{"$f":"IF(Meetings!I27=\"\",\"\",getAddress(Meetings!I27))","v":"http://www.tabonline.com.au/2011/10/25/TG06.html"},{"$f":"IF(Meetings!J27=\"\",\"\",getAddress(Meetings!J27))","v":"http://www.tabonline.com.au/2011/10/25/TG07.html"},{"$f":"IF(Meetings!K27=\"\",\"\",getAddress(Meetings!K27))","v":"http://www.tabonline.com.au/2011/10/25/TG08.html"},{"$f":"IF(Meetings!L27=\"\",\"\",getAddress(Meetings!L27))","v":"http://www.tabonline.com.au/2011/10/25/TG09.html"},{"$f":"IF(Meetings!M27=\"\",\"\",getAddress(Meetings!M27))","v":"http://www.tabonline.com.au/2011/10/25/TG10.html"},{"$f":"IF(Meetings!O27=\"\",\"\",Meetings!O27)","v":""},{"$f":"IF(Meetings!AE27=\"\",\"\",Meetings!AE27)","v":""}]
[{"$f":"IF(Race!N24<>\"\",(CLEAN(TRIM(Race!C24))),\"\")","v":""},{"$f":"IF(A26<>\"\",Race!N24,\"\")","v":""},null,null,null,"",{"$f":"IF(Meetings!B28=\"\",\"\",Meetings!B28)","v":""},{"$f":"IF(Meetings!D28=\"\",\"\",getAddress(Meetings!D28))","v":""},{"$f":"IF(Meetings!E28=\"\",\"\",getAddress(Meetings!E28))","v":""},{"$f":"IF(Meetings!F28=\"\",\"\",getAddress(Meetings!F28))","v":""},{"$f":"IF(Meetings!G28=\"\",\"\",getAddress(Meetings!G28))","v":""},{"$f":"IF(Meetings!H28=\"\",\"\",getAddress(Meetings!H28))","v":""},{"$f":"IF(Meetings!I28=\"\",\"\",getAddress(Meetings!I28))","v":""},{"$f":"IF(Meetings!J28=\"\",\"\",getAddress(Meetings!J28))","v":""},{"$f":"IF(Meetings!K28=\"\",\"\",getAddress(Meetings!K28))","v":""},{"$f":"IF(Meetings!L28=\"\",\"\",getAddress(Meetings!L28))","v":""},{"$f":"IF(Meetings!M28=\"\",\"\",getAddress(Meetings!M28))","v":""},{"$f":"IF(Meetings!O28=\"\",\"\",Meetings!O28)","v":""},{"$f":"IF(Meetings!AE28=\"\",\"\",Meetings!AE28)","v":""}]
[{"$f":"IF(Race!N25<>\"\",(CLEAN(TRIM(Race!C25))),\"\")","v":""},{"$f":"IF(A27<>\"\",Race!N25,\"\")","v":""},null,null,null,"",{"$f":"IF(Meetings!B29=\"\",\"\",Meetings!B29)","v":""},{"$f":"IF(Meetings!D29=\"\",\"\",getAddress(Meetings!D29))","v":""},{"$f":"IF(Meetings!E29=\"\",\"\",getAddress(Meetings!E29))","v":""},{"$f":"IF(Meetings!F29=\"\",\"\",getAddress(Meetings!F29))","v":""},{"$f":"IF(Meetings!G29=\"\",\"\",getAddress(Meetings!G29))","v":""},{"$f":"IF(Meetings!H29=\"\",\"\",getAddress(Meetings!H29))","v":""},{"$f":"IF(Meetings!I29=\"\",\"\",getAddress(Meetings!I29))","v":""},{"$f":"IF(Meetings!J29=\"\",\"\",getAddress(Meetings!J29))","v":""},{"$f":"IF(Meetings!K29=\"\",\"\",getAddress(Meetings!K29))","v":""},{"$f":"IF(Meetings!L29=\"\",\"\",getAddress(Meetings!L29))","v":""},{"$f":"IF(Meetings!M29=\"\",\"\",getAddress(Meetings!M29))","v":""},{"$f":"IF(Meetings!O29=\"\",\"\",Meetings!O29)","v":""},{"$f":"IF(Meetings!AE29=\"\",\"\",Meetings!AE29)","v":""}]
[{"$f":"IF(Race!N26<>\"\",(CLEAN(TRIM(Race!C26))),\"\")","v":""},{"$f":"IF(A28<>\"\",Race!N26,\"\")","v":""},null,null,null,"",{"$f":"IF(Meetings!B30=\"\",\"\",Meetings!B30)","v":""},{"$f":"IF(Meetings!D30=\"\",\"\",getAddress(Meetings!D30))","v":""},{"$f":"IF(Meetings!E30=\"\",\"\",getAddress(Meetings!E30))","v":""},{"$f":"IF(Meetings!F30=\"\",\"\",getAddress(Meetings!F30))","v":""},{"$f":"IF(Meetings!G30=\"\",\"\",getAddress(Meetings!G30))","v":""},{"$f":"IF(Meetings!H30=\"\",\"\",getAddress(Meetings!H30))","v":""},{"$f":"IF(Meetings!I30=\"\",\"\",getAddress(Meetings!I30))","v":""},{"$f":"IF(Meetings!J30=\"\",\"\",getAddress(Meetings!J30))","v":""},{"$f":"IF(Meetings!K30=\"\",\"\",getAddress(Meetings!K30))","v":""},{"$f":"IF(Meetings!L30=\"\",\"\",getAddress(Meetings!L30))","v":""},{"$f":"IF(Meetings!M30=\"\",\"\",getAddress(Meetings!M30))","v":""},{"$f":"IF(Meetings!O30=\"\",\"\",Meetings!O30)","v":""},{"$f":"IF(Meetings!AE30=\"\",\"\",Meetings!AE30)","v":""}]
[{"$f":"IF(Race!N27<>\"\",(CLEAN(TRIM(Race!C27))),\"\")","v":""},{"$f":"IF(A29<>\"\",Race!N27,\"\")","v":""},null,null,null,"",{"$f":"IF(Meetings!B31=\"\",\"\",Meetings!B31)","v":""},{"$f":"IF(Meetings!D31=\"\",\"\",getAddress(Meetings!D31))","v":""},{"$f":"IF(Meetings!E31=\"\",\"\",getAddress(Meetings!E31))","v":""},{"$f":"IF(Meetings!F31=\"\",\"\",getAddress(Meetings!F31))","v":""},{"$f":"IF(Meetings!G31=\"\",\"\",getAddress(Meetings!G31))","v":""},{"$f":"IF(Meetings!H31=\"\",\"\",getAddress(Meetings!H31))","v":""},{"$f":"IF(Meetings!I31=\"\",\"\",getAddress(Meetings!I31))","v":""},{"$f":"IF(Meetings!J31=\"\",\"\",getAddress(Meetings!J31))","v":""},{"$f":"IF(Meetings!K31=\"\",\"\",getAddress(Meetings!K31))","v":""},{"$f":"IF(Meetings!L31=\"\",\"\",getAddress(Meetings!L31))","v":""},{"$f":"IF(Meetings!M31=\"\",\"\",getAddress(Meetings!M31))","v":""},{"$f":"IF(Meetings!O31=\"\",\"\",Meetings!O31)","v":""},{"$f":"IF(Meetings!AE31=\"\",\"\",Meetings!AE31)","v":""}]
[{"$f":"IF(Race!N28<>\"\",(CLEAN(TRIM(Race!C28))),\"\")","v":""},{"$f":"IF(A30<>\"\",Race!N28,\"\")","v":""},null,null,null,"",{"$f":"IF(Meetings!B32=\"\",\"\",Meetings!B32)","v":""},{"$f":"IF(Meetings!D32=\"\",\"\",getAddress(Meetings!D32))","v":""},{"$f":"IF(Meetings!E32=\"\",\"\",getAddress(Meetings!E32))","v":""},{"$f":"IF(Meetings!F32=\"\",\"\",getAddress(Meetings!F32))","v":""},{"$f":"IF(Meetings!G32=\"\",\"\",getAddress(Meetings!G32))","v":""},{"$f":"IF(Meetings!H32=\"\",\"\",getAddress(Meetings!H32))","v":""},{"$f":"IF(Meetings!I32=\"\",\"\",getAddress(Meetings!I32))","v":""},{"$f":"IF(Meetings!J32=\"\",\"\",getAddress(Meetings!J32))","v":""},{"$f":"IF(Meetings!K32=\"\",\"\",getAddress(Meetings!K32))","v":""},{"$f":"IF(Meetings!L32=\"\",\"\",getAddress(Meetings!L32))","v":""},{"$f":"IF(Meetings!M32=\"\",\"\",getAddress(Meetings!M32))","v":""},{"$f":"IF(Meetings!O32=\"\",\"\",Meetings!O32)","v":""},{"$f":"IF(Meetings!AE32=\"\",\"\",Meetings!AE32)","v":""}]
[{"$f":"IF(Race!N29<>\"\",(CLEAN(TRIM(Race!C29))),\"\")","v":""},{"$f":"IF(A31<>\"\",Race!N29,\"\")","v":""},null,null,null,"",{"$f":"IF(Meetings!B33=\"\",\"\",Meetings!B33)","v":""},{"$f":"IF(Meetings!D33=\"\",\"\",getAddress(Meetings!D33))","v":""},{"$f":"IF(Meetings!E33=\"\",\"\",getAddress(Meetings!E33))","v":""},{"$f":"IF(Meetings!F33=\"\",\"\",getAddress(Meetings!F33))","v":""},{"$f":"IF(Meetings!G33=\"\",\"\",getAddress(Meetings!G33))","v":""},{"$f":"IF(Meetings!H33=\"\",\"\",getAddress(Meetings!H33))","v":""},{"$f":"IF(Meetings!I33=\"\",\"\",getAddress(Meetings!I33))","v":""},{"$f":"IF(Meetings!J33=\"\",\"\",getAddress(Meetings!J33))","v":""},{"$f":"IF(Meetings!K33=\"\",\"\",getAddress(Meetings!K33))","v":""},{"$f":"IF(Meetings!L33=\"\",\"\",getAddress(Meetings!L33))","v":""},{"$f":"IF(Meetings!M33=\"\",\"\",getAddress(Meetings!M33))","v":""},{"$f":"IF(Meetings!O33=\"\",\"\",Meetings!O33)","v":""},{"$f":"IF(Meetings!AE33=\"\",\"\",Meetings!AE33)","v":""}]
[{"$f":"IF(Race!N30<>\"\",(CLEAN(TRIM(Race!C30))),\"\")","v":""},{"$f":"IF(A32<>\"\",Race!N30,\"\")","v":""},null,null,null,"",{"$f":"IF(Meetings!B34=\"\",\"\",Meetings!B34)","v":""},{"$f":"IF(Meetings!D34=\"\",\"\",getAddress(Meetings!D34))","v":""},{"$f":"IF(Meetings!E34=\"\",\"\",getAddress(Meetings!E34))","v":""},{"$f":"IF(Meetings!F34=\"\",\"\",getAddress(Meetings!F34))","v":""},{"$f":"IF(Meetings!G34=\"\",\"\",getAddress(Meetings!G34))","v":""},{"$f":"IF(Meetings!H34=\"\",\"\",getAddress(Meetings!H34))","v":""},{"$f":"IF(Meetings!I34=\"\",\"\",getAddress(Meetings!I34))","v":""},{"$f":"IF(Meetings!J34=\"\",\"\",getAddress(Meetings!J34))","v":""},{"$f":"IF(Meetings!K34=\"\",\"\",getAddress(Meetings!K34))","v":""},{"$f":"IF(Meetings!L34=\"\",\"\",getAddress(Meetings!L34))","v":""},{"$f":"IF(Meetings!M34=\"\",\"\",getAddress(Meetings!M34))","v":""},{"$f":"IF(Meetings!O34=\"\",\"\",Meetings!O34)","v":""},{"$f":"IF(Meetings!AE34=\"\",\"\",Meetings!AE34)","v":""}]
[{"$f":"IF(Race!N31<>\"\",(CLEAN(TRIM(Race!C31))),\"\")","v":""},{"$f":"IF(A33<>\"\",Race!N31,\"\")","v":""},null,null,null,"",{"$f":"IF(Meetings!B35=\"\",\"\",Meetings!B35)","v":""},{"$f":"IF(Meetings!D35=\"\",\"\",getAddress(Meetings!D35))","v":""},{"$f":"IF(Meetings!E35=\"\",\"\",getAddress(Meetings!E35))","v":""},{"$f":"IF(Meetings!F35=\"\",\"\",getAddress(Meetings!F35))","v":""},{"$f":"IF(Meetings!G35=\"\",\"\",getAddress(Meetings!G35))","v":""},{"$f":"IF(Meetings!H35=\"\",\"\",getAddress(Meetings!H35))","v":""},{"$f":"IF(Meetings!I35=\"\",\"\",getAddress(Meetings!I35))","v":""},{"$f":"IF(Meetings!J35=\"\",\"\",getAddress(Meetings!J35))","v":""},{"$f":"IF(Meetings!K35=\"\",\"\",getAddress(Meetings!K35))","v":""},{"$f":"IF(Meetings!L35=\"\",\"\",getAddress(Meetings!L35))","v":""},{"$f":"IF(Meetings!M35=\"\",\"\",getAddress(Meetings!M35))","v":""},{"$f":"IF(Meetings!O35=\"\",\"\",Meetings!O35)","v":""},{"$f":"IF(Meetings!AE35=\"\",\"\",Meetings!AE35)","v":""}]
[{"$f":"IF(Race!N32<>\"\",(CLEAN(TRIM(Race!C32))),\"\")","v":""},{"$f":"IF(A34<>\"\",Race!N32,\"\")","v":""},{"$nulls":5},{"$f":"IF(Meetings!D36=\"\",\"\",getAddress(Meetings!D36))","v":""},{"$f":"IF(Meetings!E36=\"\",\"\",getAddress(Meetings!E36))","v":""},{"$f":"IF(Meetings!F36=\"\",\"\",getAddress(Meetings!F36))","v":""},{"$f":"IF(Meetings!G36=\"\",\"\",getAddress(Meetings!G36))","v":""},{"$f":"IF(Meetings!H36=\"\",\"\",getAddress(Meetings!H36))","v":""},{"$f":"IF(Meetings!I36=\"\",\"\",getAddress(Meetings!I36))","v":""},{"$f":"IF(Meetings!J36=\"\",\"\",getAddress(Meetings!J36))","v":""},{"$f":"IF(Meetings!K36=\"\",\"\",getAddress(Meetings!K36))","v":""},{"$f":"IF(Meetings!L36=\"\",\"\",getAddress(Meetings!L36))","v":""},{"$f":"IF(Meetings!M36=\"\",\"\",getAddress(Meetings!M36))","v":""}]
[{"$f":"IF(Race!N33<>\"\",(CLEAN(TRIM(Race!C33))),\"\")","v":""},{"$f":"IF(A35<>\"\",Race!N33,\"\")","v":""},{"$nulls":5},{"$f":"IF(Meetings!D37=\"\",\"\",getAddress(Meetings!D37))","v":""},{"$f":"IF(Meetings!E37=\"\",\"\",getAddress(Meetings!E37))","v":""},{"$f":"IF(Meetings!F37=\"\",\"\",getAddress(Meetings!F37))","v":""},{"$f":"IF(Meetings!G37=\"\",\"\",getAddress(Meetings!G37))","v":""},{"$f":"IF(Meetings!H37=\"\",\"\",getAddress(Meetings!H37))","v":""},{"$f":"IF(Meetings!I37=\"\",\"\",getAddress(Meetings!I37))","v":""},{"$f":"IF(Meetings!J37=\"\",\"\",getAddress(Meetings!J37))","v":""},{"$f":"IF(Meetings!K37=\"\",\"\",getAddress(Meetings!K37))","v":""},{"$f":"IF(Meetings!L37=\"\",\"\",getAddress(Meetings!L37))","v":""},{"$f":"IF(Meetings!M37=\"\",\"\",getAddress(Meetings!M37))","v":""}]
[{"$f":"IF(Race!N34<>\"\",(CLEAN(TRIM(Race!C34))),\"\")","v":""},{"$f":"IF(A36<>\"\",Race!N34,\"\")","v":""},{"$nulls":5},{"$f":"IF(Meetings!D38=\"\",\"\",getAddress(Meetings!D38))","v":""},{"$f":"IF(Meetings!E38=\"\",\"\",getAddress(Meetings!E38))","v":""},{"$f":"IF(Meetings!F38=\"\",\"\",getAddress(Meetings!F38))","v":""},{"$f":"IF(Meetings!G38=\"\",\"\",getAddress(Meetings!G38))","v":""},{"$f":"IF(Meetings!H38=\"\",\"\",getAddress(Meetings!H38))","v":""},{"$f":"IF(Meetings!I38=\"\",\"\",getAddress(Meetings!I38))","v":""},{"$f":"IF(Meetings!J38=\"\",\"\",getAddress(Meetings!J38))","v":""},{"$f":"IF(Meetings!K38=\"\",\"\",getAddress(Meetings!K38))","v":""},{"$f":"IF(Meetings!L38=\"\",\"\",getAddress(Meetings!L38))","v":""},{"$f":"IF(Meetings!M38=\"\",\"\",getAddress(Meetings!M38))","v":""}]
[{"$nulls":7},{"$f":"IF(Meetings!D39=\"\",\"\",getAddress(Meetings!D39))","v":""},{"$f":"IF(Meetings!E39=\"\",\"\",getAddress(Meetings!E39))","v":""},{"$f":"IF(Meetings!F39=\"\",\"\",getAddress(Meetings!F39))","v":""},{"$f":"IF(Meetings!G39=\"\",\"\",getAddress(Meetings!G39))","v":""},{"$f":"IF(Meetings!H39=\"\",\"\",getAddress(Meetings!H39))","v":""},{"$f":"IF(Meetings!I39=\"\",\"\",getAddress(Meetings!I39))","v":""},{"$f":"IF(Meetings!J39=\"\",\"\",getAddress(Meetings!J39))","v":""},{"$f":"IF(Meetings!K39=\"\",\"\",getAddress(Meetings!K39))","v":""},{"$f":"IF(Meetings!L39=\"\",\"\",getAddress(Meetings!L39))","v":""},{"$f":"IF(Meetings!M39=\"\",\"\",getAddress(Meetings!M39))","v":""}]
[{"$nulls":7},{"$f":"IF(Meetings!D40=\"\",\"\",getAddress(Meetings!D40))","v":""},{"$f":"IF(Meetings!E40=\"\",\"\",getAddress(Meetings!E40))","v":""},{"$f":"IF(Meetings!F40=\"\",\"\",getAddress(Meetings!F40))","v":""},{"$f":"IF(Meetings!G40=\"\",\"\",getAddress(Meetings!G40))","v":""},{"$f":"IF(Meetings!H40=\"\",\"\",getAddress(Meetings!H40))","v":""},{"$f":"IF(Meetings!I40=\"\",\"\",getAddress(Meetings!I40))","v":""},{"$f":"IF(Meetings!J40=\"\",\"\",getAddress(Meetings!J40))","v":""},{"$f":"IF(Meetings!K40=\"\",\"\",getAddress(Meetings!K40))","v":""},{"$f":"IF(Meetings!L40=\"\",\"\",getAddress(Meetings!L40))","v":""},{"$f":"IF(Meetings!M40=\"\",\"\",getAddress(Meetings!M40))","v":""}]
[{"$nulls":7},{"$f":"IF(Meetings!D41=\"\",\"\",getAddress(Meetings!D41))","v":""},{"$f":"IF(Meetings!E41=\"\",\"\",getAddress(Meetings!E41))","v":""},{"$f":"IF(Meetings!F41=\"\",\"\",getAddress(Meetings!F41))","v":""},{"$f":"IF(Meetings!G41=\"\",\"\",getAddress(Meetings!G41))","v":""},{"$f":"IF(Meetings!H41=\"\",\"\",getAddress(Meetings!H41))","v":""},{"$f":"IF(Meetings!I41=\"\",\"\",getAddress(Meetings!I41))","v":""},{"$f":"IF(Meetings!J41=\"\",\"\",getAddress(Meetings!J41))","v":""},{"$f":"IF(Meetings!K41=\"\",\"\",getAddress(Meetings!K41))","v":""},{"$f":"IF(Meetings!L41=\"\",\"\",getAddress(Meetings!L41))","v":""},{"$f":"IF(Meetings!M41=\"\",\"\",getAddress(Meetings!M41))","v":""}]
[{"$nulls":7},{"$f":"IF(Meetings!D42=\"\",\"\",getAddress(Meetings!D42))","v":""},{"$f":"IF(Meetings!E42=\"\",\"\",getAddress(Meetings!E42))","v":""},{"$f":"IF(Meetings!F42=\"\",\"\",getAddress(Meetings!F42))","v":""},{"$f":"IF(Meetings!G42=\"\",\"\",getAddress(Meetings!G42))","v":""},{"$f":"IF(Meetings!H42=\"\",\"\",getAddress(Meetings!H42))","v":""},{"$f":"IF(Meetings!I42=\"\",\"\",getAddress(Meetings!I42))","v":""},{"$f":"IF(Meetings!J42=\"\",\"\",getAddress(Meetings!J42))","v":""},{"$f":"IF(Meetings!K42=\"\",\"\",getAddress(Meetings!K42))","v":""},{"$f":"IF(Meetings!L42=\"\",\"\",getAddress(Meetings!L42))","v":""},{"$f":"IF(Meetings!M42=\"\",\"\",getAddress(Meetings!M42))","v":""}]
[{"$nulls":7},{"$f":"IF(Meetings!D43=\"\",\"\",getAddress(Meetings!D43))","v":""},{"$f":"IF(Meetings!E43=\"\",\"\",getAddress(Meetings!E43))","v":""},{"$f":"IF(Meetings!F43=\"\",\"\",getAddress(Meetings!F43))","v":""},{"$f":"IF(Meetings!G43=\"\",\"\",getAddress(Meetings!G43))","v":""},{"$f":"IF(Meetings!H43=\"\",\"\",getAddress(Meetings!H43))","v":""},{"$f":"IF(Meetings!I43=\"\",\"\",getAddress(Meetings!I43))","v":""},{"$f":"IF(Meetings!J43=\"\",\"\",getAddress(Meetings!J43))","v":""},{"$f":"IF(Meetings!K43=\"\",\"\",getAddress(Meetings!K43))","v":""},{"$f":"IF(Meetings!L43=\"\",\"\",getAddress(Meetings!L43))","v":""},{"$f":"IF(Meetings!M43=\"\",\"\",getAddress(Meetings!M43))","v":""}]
[{"$nulls":7},{"$f":"IF(Meetings!D44=\"\",\"\",getAddress(Meetings!D44))","v":""},{"$f":"IF(Meetings!E44=\"\",\"\",getAddress(Meetings!E44))","v":""},{"$f":"IF(Meetings!F44=\"\",\"\",getAddress(Meetings!F44))","v":""},{"$f":"IF(Meetings!G44=\"\",\"\",getAddress(Meetings!G44))","v":""},{"$f":"IF(Meetings!H44=\"\",\"\",getAddress(Meetings!H44))","v":""},{"$f":"IF(Meetings!I44=\"\",\"\",getAddress(Meetings!I44))","v":""},{"$f":"IF(Meetings!J44=\"\",\"\",getAddress(Meetings!J44))","v":""},{"$f":"IF(Meetings!K44=\"\",\"\",getAddress(Meetings!K44))","v":""},{"$f":"IF(Meetings!L44=\"\",\"\",getAddress(Meetings!L44))","v":""},{"$f":"IF(Meetings!M44=\"\",\"\",getAddress(Meetings!M44))","v":""}]
[{"$nulls":7},{"$f":"IF(Meetings!D45=\"\",\"\",getAddress(Meetings!D45))","v":""},{"$f":"IF(Meetings!E45=\"\",\"\",getAddress(Meetings!E45))","v":""},{"$f":"IF(Meetings!F45=\"\",\"\",getAddress(Meetings!F45))","v":""},{"$f":"IF(Meetings!G45=\"\",\"\",getAddress(Meetings!G45))","v":""},{"$f":"IF(Meetings!H45=\"\",\"\",getAddress(Meetings!H45))","v":""},{"$f":"IF(Meetings!I45=\"\",\"\",getAddress(Meetings!I45))","v":""},{"$f":"IF(Meetings!J45=\"\",\"\",getAddress(Meetings!J45))","v":""},{"$f":"IF(Meetings!K45=\"\",\"\",getAddress(Meetings!K45))","v":""},{"$f":"IF(Meetings!L45=\"\",\"\",getAddress(Meetings!L45))","v":""},{"$f":"IF(Meetings!M45=\"\",\"\",getAddress(Meetings!M45))","v":""}]
[{"$nulls":7},{"$f":"IF(Meetings!D46=\"\",\"\",getAddress(Meetings!D46))","v":""},{"$f":"IF(Meetings!E46=\"\",\"\",getAddress(Meetings!E46))","v":""},{"$f":"IF(Meetings!F46=\"\",\"\",getAddress(Meetings!F46))","v":""},{"$f":"IF(Meetings!G46=\"\",\"\",getAddress(Meetings!G46))","v":""},{"$f":"IF(Meetings!H46=\"\",\"\",getAddress(Meetings!H46))","v":""},{"$f":"IF(Meetings!I46=\"\",\"\",getAddress(Meetings!I46))","v":""},{"$f":"IF(Meetings!J46=\"\",\"\",getAddress(Meetings!J46))","v":""},{"$f":"IF(Meetings!K46=\"\",\"\",getAddress(Meetings!K46))","v":""},{"$f":"IF(Meetings!L46=\"\",\"\",getAddress(Meetings!L46))","v":""},{"$f":"IF(Meetings!M46=\"\",\"\",getAddress(Meetings!M46))","v":""}]
[{"$nulls":7},{"$f":"IF(Meetings!D47=\"\",\"\",getAddress(Meetings!D47))","v":""},{"$f":"IF(Meetings!E47=\"\",\"\",getAddress(Meetings!E47))","v":""},{"$f":"IF(Meetings!F47=\"\",\"\",getAddress(Meetings!F47))","v":""},{"$f":"IF(Meetings!G47=\"\",\"\",getAddress(Meetings!G47))","v":""},{"$f":"IF(Meetings!H47=\"\",\"\",getAddress(Meetings!H47))","v":""},{"$f":"IF(Meetings!I47=\"\",\"\",getAddress(Meetings!I47))","v":""},{"$f":"IF(Meetings!J47=\"\",\"\",getAddress(Meetings!J47))","v":""},{"$f":"IF(Meetings!K47=\"\",\"\",getAddress(Meetings!K47))","v":""},{"$f":"IF(Meetings!L47=\"\",\"\",getAddress(Meetings!L47))","v":""},{"$f":"IF(Meetings!M47=\"\",\"\",getAddress(Meetings!M47))","v":""}]

{"sheet":"Meetings","index":3,"n_rows":27,"n_cols":15,"rows_kept":27,"cut":false,"hidden":false,"merged":[[16,0,16,2],[1,0,1,2],[9,0,9,2]]}
[]
["Races",null,null,1,2,3,4,5,6,7,8,9,10,11,12]
[null,"TOWNSVILLE (QR)","Fields","5,8,2 F4","Interim F4","26m F4","2:35 F4","3:10 F4","3:45 F4","4:22 F4","4:57 F4"]
[null,"TAREE (NR)","Fields","8,7,6 ","2,11,6 ","11m ","46m ","2:50 F4","3:25 F4","4:05 F4","4:40 F4"]
[null,"SEYMOUR (VR)","Fields","11,9,1 ","6,8,3 ","1,7,6 ","1m ","31m F4","2:30 F4","3:00 F4","3:30 F4"]
[null,"CHEPSTOW (BS)","Fields","11:10:00","11:40:00","12:10am ","12:40am "]
[null,"CLAIRWOOD (AS)","Fields","08:30:00","09:05:00","09:40:00","10:15:00","10:50:00","11:25:00","12:05am ","12:40am "]
[null,"CATTERICK BRIDGE (CS)","Fields","10:50:00","11:20:00","11:50:00","12:20am ","12:50am "]
[null,"GREAT YARMOUTH (ES)","Fields","10:30:00","11:00:00","11:30:00","12:00am ","12:30am "]
["Trots",null,null,1,2,3,4,5,6,7,8,9,10,11,12]
[null,"ALBION PARK (BT)","Fields","Closed F4","38m F4","2:42 F4","3:17 F4","3:53 F4","4:31 F4","5:06 F4"]
[null,"MENANGLE (ST)","Fields","6,4,7 ","18m ","53m ","02:57:00","03:37:00","04:12:00","04:47:00","05:15:00"]
[null,"BENDIGO (MT)","Fields","05:32:00","06:00:00","06:30:00","07:00:00","07:30:00","08:00:00","08:30:00","09:00:00"]
[null,"GLOBE DERBY (AT)","Fields","5:40 F4","6:10 F4","6:40 F4","7:10 F4","7:40 F4","8:10 F4","8:40 F4"]
[null,"NORTHAM (PT)","Fields","Abnd ","Abnd ","Abnd ","Abnd ","Abnd ","Abnd ","Abnd ","Abnd "]
[null,"ASCOT PARK (ZT)","Fields","5,3,6 ","13,2,3 ","3,1,2 ","4,2,10 ","6,3,8 ","11,3,15 ","8,13,7 ","11,7,2 ","15,2,6 ","Interim "]
["Greyhounds",null,null,1,2,3,4,5,6,7,8,9,10,11,12]
[null,"IPSWICH (BG)","Fields","3:05 F4","3:22 F4","3:42 F4","3:58 F4","4:18 F4","4:37 F4","4:53 F4","5:12 F4","5:28 F4","5:52 F4"]
[null,"GOSFORD (SG)","Fields","05:58:00","06:18:00","06:36:00","06:58:00","07:18:00","07:38:00","07:58:00","08:18:00","08:38:00","08:58:00"]
[null,"WARRAGUL (MG)","Fields","05:49:00","06:08:00","06:28:00","06:48:00","07:08:00","07:28:00","07:48:00","08:08:00","08:28:00","08:48:00","09:06:00","09:25:00"]
[null,"TOWNSVILLE (QG)","Fields","6:55 F4","7:15 F4","7:35 F4","7:55 F4","8:15 F4","8:35 F4","8:55 F4","9:18 F4","9:36 F4","9:56 F4"]
[null,"LISMORE (NG)","Fields","05:45:00","06:05:00","06:25:00","06:45:00","07:05:00","07:25:00","07:45:00","08:05:00","08:25:00","08:45:00"]
[null,"HORSHAM (VG)","Fields","02:54:00","03:14:00","03:34:00","03:50:00","04:09:00","04:27:00","04:44:00","05:02:00","05:22:00","05:37:00","05:55:00","06:15:00"]
[null,"GAWLER (AG)","Fields","8,1,2 F4","4,1,8 F4","2,3,7 F4","8,3,2 F4","3,4,1 F4","4,6,5 F4","6m F4","23m F4","43m F4","59m F4","2:47 F4"]
[null,"MANDURAH (PG)","Fields","08:07:00","08:27:00","08:44:00","08:59:00","09:15:00","09:32:00","09:52:00","10:10:00","10:27:00","10:42:00","10:57:00","11:17:00"]
[null,"ADDINGTON (ZG)","Fields","4,3,8 ","8,5,7 ","1,8,7 ","1,5,6 ","1,9,2 ","3,2,1 ","6,1,8 ","5,4,1 ","1,7,6 ","4,1,3 ","8,4,5 ","1,2,3 "]
[null,"DEVONPORT (TG)","Fields","7,5,8 ","6,4,8 ","1,8,10 ","3,4,9 ","4,5,8 ","1,8,3 ","Interim ","15m ","35m ","50m ","02:39:00"]

{"sheet":"Race","index":4,"n_rows":26,"n_cols":13,"rows_kept":26,"cut":false,"hidden":false,"merged":[]}
[]
["TOWNSVILLE",null,"QG 8","Jump","09:18:00"]
[null,null,null,"Odds","01:18:00"]
["2011-10-25","NORTH QUEENSLAND CUP HT3"]
["RADIO TAB","4-2-3-5",null,null,null,"498M","FINE","GOOD"]
["No.",null,"Name","11:39:00","Win","Plc",null,"Trainer  ","Box",null,null,"L3S","Rtng"]
[1,null,"SAMMY BOOKER",{"$nulls":4},"SCRATCHED"]
[2,null,"ANDY'S CHAOS",5.0999999999999996,11.9,3.4,null,"G OLSEN",null,null,null,113,86]
[3,null,"GALLIVANT GIRL",5.0999999999999996,11.9,3.4,null,"P RUDALL",null,null,null,723,97]
[4,null,"DON'T LISTEN",0,11.9,3.4,null,"B BELFORD",null,null,null,231,100]
[5,null,"GABLE ROULETTE",0,0,0,null,"M CAMPBELL",null,null,null,187,94]
[6,null,"ASAMOAH",5.0999999999999996,1.9,1,null,"M RAJAN",null,null,null,174,92]
[7,null,"RALPHY ROCKET",5.0999999999999996,5.9,3.4,null,"G OLSEN",null,null,null,542,83]
[8,null,"OUTBACK THUNDER",5.0999999999999996,11.9,3.4,null,"N VOHLAND",null,null,null,621,92]
[9,null,"GOZO FAST GIRL",{"$nulls":4},"SCRATCHED"]
[10,null,"SAN NEGARD",5.0999999999999996,5.9,1.7,null,"G THOMSON",1,null,null,785,85]
[]
["UNiTAB Pool Totals"]
["WN",14,"QN",22,"TF",35,"DD(7,8) "]
["PL",12,"EX",20,"F4",2,"TT(6,7,8) "]
[null,null,"A2",12,null,null,"QD(5,6,7,8) "]
[]
["<< QG  1  2  3  4  5  6  7  8  9  10  DD/TT/QD  XD Trainers >>"]
[]
["Help","Gambling Advice","TAB Home","Refresh"]
["© Copyright UNiTAB Ltd","Created: Tue, 25 Oct 2011 13:34:59 Aust EST"]

{"sheet":"Selections","index":5,"n_rows":100,"n_cols":15,"rows_kept":100,"cut":false,"hidden":false,"merged":[]}
["Venue",null,"Race",null,"No","Runner",null,null,"Win","Place",null,null,"Bets"]
["SEYMOUR ",null,1,null,4,"Hookedonafeeling",null,null,"","",null,null,{"$f":"IF(E2=\"\",\"\",E2&\". \"&F2)","v":"4. Hookedonafeeling"},{"$f":"IF(M2=\"\",\"\",A2)","v":"SEYMOUR "},{"$f":"IF(M2=\"\",\"\",C2)","v":1}]
["SEYMOUR ",null,2,null,3,"Flying Above",null,null,0,1.3,null,null,{"$f":"IF(E3=\"\",\"\",E3&\". \"&F3)","v":"3. Flying Above"},{"$f":"IF(M3=\"\",\"\",A3)","v":"SEYMOUR "},{"$f":"IF(M3=\"\",\"\",C3)","v":2}]
["SEYMOUR ",null,3,null,7,"Tizona",null,null,0,1.4,null,null,"7. Tizona","SEYMOUR ",3]
["SEYMOUR ",null,4,null,5,"Blasting",null,null,0,1,null,null,"5. Blasting","SEYMOUR ",4]
["SEYMOUR ",null,5,null,8,"Mossailey",null,null,"","",null,null,"8. Mossailey","SEYMOUR ",5]
["SEYMOUR ",null,6,null,9,"Victoria Street",null,null,"","",null,null,"9. Victoria Street","SEYMOUR ",6]
["SEYMOUR ",null,7,null,8,"Caradin",null,null,"","",null,null,"8. Caradin","SEYMOUR ",7]
["SEYMOUR ",null,8,null,7,"Exceed And Excite",null,null,"","",null,null,"7. Exceed And Excite","SEYMOUR ",8]
["TAREE ",null,1,null,8,"Slumdogmillionaire",null,null,5,1.5,null,null,"8. Slumdogmillionaire","TAREE ",1]
["TAREE ",null,2,null,10,"Senorita Margarita",null,null,"","",null,null,"10. Senorita Margarita","TAREE ",2]
["TAREE ",null,3,null,1,"Eishin Rock",null,null,2,1.1000000000000001,null,null,"1. Eishin Rock","TAREE ",3]
["TAREE ",null,4,null,2,"Cypress Ponds",null,null,"","",null,null,"2. Cypress Ponds","TAREE ",4]
["TAREE ",null,5,null,4,"Brick",null,null,"","",null,null,"4. Brick","TAREE ",5]
["TAREE ",null,6,null,1,"Lotsa Lobban",null,null,"","",null,null,"1. Lotsa Lobban","TAREE ",6]
["TAREE ",null,7,null,14,"Now Who'S Cautious",null,null,"","",null,null,"14. Now Who'S Cautious","TAREE ",7]
["TAREE ",null,8,null,3,"Floral Insight",null,null,"","",null,null,"3. Floral Insight","TAREE ",8]
["TOWNSVILLE ",null,1,null,3,"Grimhild'S Revenge",null,null,"","",null,null,"3. Grimhild'S Revenge","TOWNSVILLE ",1]
["TOWNSVILLE ",null,2,null,2,"Crimea",null,null,"","",null,null,"2. Crimea","TOWNSVILLE ",2]
["TOWNSVILLE ",null,3,null,3,"Deb'S Hope",null,null,"","",null,null,"3. Deb'S Hope","TOWNSVILLE ",3]
["TOWNSVILLE ",null,4,null,8,"Vantabulous",null,null,"","",null,null,"8. Vantabulous","TOWNSVILLE ",4]
["TOWNSVILLE ",null,5,null,9,"Inter Stargaze",null,null,"","",null,null,"9. Inter Stargaze","TOWNSVILLE ",5]
["TOWNSVILLE ",null,6,null,2,"Lightfeet Lady",null,null,"","",null,null,"2. Lightfeet Lady","TOWNSVILLE ",6]
["TOWNSVILLE ",null,7,null,1,"Been Broke Before",null,null,"","",null,null,"1. Been Broke Before","TOWNSVILLE ",7]
["TOWNSVILLE ",null,8,null,2,"Super Shadow",null,null,"","",null,null,"2. Super Shadow","TOWNSVILLE ",8]
[{"$nulls":12},"","",""]
[{"$nulls":12},"","",""]
[{"$nulls":12},"","",""]
[{"$nulls":12},"","",""]
[{"$nulls":12},"","",""]
[{"$nulls":12},"","",""]
[{"$nulls":12},"","",""]
[{"$nulls":12},"","",""]
[{"$nulls":12},"","",""]
[{"$nulls":12},"","",""]
[{"$nulls":12},"","",""]
[{"$nulls":12},"","",""]
[{"$nulls":12},"","",""]
[{"$nulls":12},"","",""]
[{"$nulls":12},"","",""]
[{"$nulls":12},"","",""]
[{"$nulls":12},"","",""]
[{"$nulls":12},"","",""]
[{"$nulls":12},"","",""]
[{"$nulls":12},"","",""]
[{"$nulls":12},"","",""]
[{"$nulls":12},"","",""]
[{"$nulls":12},"","",""]
[{"$nulls":12},"","",""]
[{"$nulls":12},"","",""]
[{"$nulls":12},"","",""]
[{"$nulls":12},"","",""]
[{"$nulls":12},"","",""]
[{"$nulls":12},"","",""]
[{"$nulls":12},"","",""]
[{"$nulls":12},"","",""]
[{"$nulls":12},"","",""]
[{"$nulls":12},"","",""]
[{"$nulls":12},"","",""]
[{"$nulls":12},"","",""]
[{"$nulls":12},"","",""]
[{"$nulls":12},"","",""]
[{"$nulls":12},"","",""]
[{"$nulls":12},"","",""]
[{"$nulls":12},"","",""]
[{"$nulls":12},"","",""]
[{"$nulls":12},{"$f":"IF(E67=\"\",\"\",E67&\". \"&F67)","v":""},{"$f":"IF(M67=\"\",\"\",A67)","v":""},{"$f":"IF(M67=\"\",\"\",C67)","v":""}]
[{"$nulls":12},"","",""]
[{"$nulls":12},"","",""]
[{"$nulls":12},"","",""]
[{"$nulls":12},"","",""]
[{"$nulls":12},"","",""]
[{"$nulls":12},"","",""]
[{"$nulls":12},"","",""]
[{"$nulls":12},"","",""]
[{"$nulls":12},"","",""]
[{"$nulls":12},"","",""]
[{"$nulls":12},"","",""]
[{"$nulls":12},"","",""]
[{"$nulls":12},"","",""]
[{"$nulls":12},"","",""]
[{"$nulls":12},"","",""]
[{"$nulls":12},"","",""]
[{"$nulls":12},"","",""]
[{"$nulls":12},"","",""]
[{"$nulls":12},"","",""]
[{"$nulls":12},"","",""]
[{"$nulls":12},"","",""]
[{"$nulls":12},"","",""]
[{"$nulls":12},"","",""]
[{"$nulls":12},"","",""]
[{"$nulls":12},"","",""]
[{"$nulls":12},"","",""]
[{"$nulls":12},"","",""]
[{"$nulls":12},"","",""]
[{"$nulls":12},"","",""]
[{"$nulls":12},"","",""]
[{"$nulls":12},"","",""]
[{"$nulls":12},"","",""]
[{"$nulls":12},"","",""]